Загрузка данных
dmitriev-aal@VDI-Dmitriev-A:~$ kubectl get events | grep ms-confirmation
40m Normal Scheduled pod/ms-confirmation-b5db7465-nlxzr Successfully assigned isys-ndbo-stress/ms-confirmation-b5db7465-nlxzr to afs1asd-wl-153
40m Normal Pulled pod/ms-confirmation-b5db7465-nlxzr Container image "registry.rshbdev.ru/appfarm/infra/images/istio/proxyv2:1.15.1-rshb.0.4.0" already present on machine
40m Normal Created pod/ms-confirmation-b5db7465-nlxzr Created container istio-init
40m Normal Started pod/ms-confirmation-b5db7465-nlxzr Started container istio-init
39m Normal Pulled pod/ms-confirmation-b5db7465-nlxzr Container image "registry.rshbdev.ru/appfarm/infra/images/istio/proxyv2:1.15.1-rshb.0.4.0" already present on machine
39m Normal Created pod/ms-confirmation-b5db7465-nlxzr Created container istio-proxy
39m Normal Started pod/ms-confirmation-b5db7465-nlxzr Started container istio-proxy
39m Warning FailedPostStartHook pod/ms-confirmation-b5db7465-nlxzr Exec lifecycle hook ([pilot-agent wait]) for Container "istio-proxy" in Pod "ms-confirmation-b5db7465-nlxzr_isys-ndbo-stress(fdc00fa2-0bc7-43c6-80c4-3ed7660f04c6)" failed - error: command 'pilot-agent wait' exited with 255: Error: timeout waiting for Envoy proxy to become ready. Last error: Get "http://localhost:15021/healthz/ready": dial tcp [::1]:15021: connect: connection refused...
39m Normal Killing pod/ms-confirmation-b5db7465-nlxzr FailedPostStartHook
39m Normal Pulling pod/ms-confirmation-b5db7465-nlxzr Pulling image "registry.rshbdev.ru/rshbintech/crft/dboul/ndbo/backend/core/ms-confirmation:stress"
39m Normal Pulled pod/ms-confirmation-b5db7465-nlxzr Successfully pulled image "registry.rshbdev.ru/rshbintech/crft/dboul/ndbo/backend/core/ms-confirmation:stress" in 71.724038ms
39m Normal Created pod/ms-confirmation-b5db7465-nlxzr Created container app
39m Normal Started pod/ms-confirmation-b5db7465-nlxzr Started container app
43s Normal SecretRotationComplete pod/ms-confirmation-b5db7465-nlxzr successfully rotated K8s secret ms-confirmation-app-secret-env
25m Warning Unhealthy pod/ms-confirmation-b5db7465-nlxzr Readiness probe failed: HTTP probe failed with statuscode: 500
5m9s Warning Unhealthy pod/ms-confirmation-b5db7465-nlxzr Liveness probe failed: HTTP probe failed with statuscode: 500
10s Warning BackOff pod/ms-confirmation-b5db7465-nlxzr Back-off restarting failed container
50m Normal SecretRotationComplete pod/ms-confirmation-b5db7465-qjp74 successfully rotated K8s secret ms-confirmation-app-secret-env
53m Warning Unhealthy pod/ms-confirmation-b5db7465-qjp74 Readiness probe failed: HTTP probe failed with statuscode: 500
59m Warning BackOff pod/ms-confirmation-b5db7465-qjp74 Back-off restarting failed container
50m Normal SuccessfulDelete replicaset/ms-confirmation-b5db7465 Deleted pod: ms-confirmation-b5db7465-qjp74
40m Normal SuccessfulCreate replicaset/ms-confirmation-b5db7465 Created pod: ms-confirmation-b5db7465-nlxzr
50m Normal Scheduled pod/ms-confirmation-f657d77b6-dswwv Successfully assigned isys-ndbo-stress/ms-confirmation-f657d77b6-dswwv to afs1asd-wl-153
50m Normal Pulled pod/ms-confirmation-f657d77b6-dswwv Container image "registry.rshbdev.ru/appfarm/infra/images/istio/proxyv2:1.15.1-rshb.0.4.0" already present on machine
50m Normal Created pod/ms-confirmation-f657d77b6-dswwv Created container istio-init
50m Normal Started pod/ms-confirmation-f657d77b6-dswwv Started container istio-init
47m Normal Pulled pod/ms-confirmation-f657d77b6-dswwv Container image "registry.rshbdev.ru/appfarm/infra/images/istio/proxyv2:1.15.1-rshb.0.4.0" already present on machine
47m Normal Created pod/ms-confirmation-f657d77b6-dswwv Created container istio-proxy
47m Normal Started pod/ms-confirmation-f657d77b6-dswwv Started container istio-proxy
49m Warning FailedPostStartHook pod/ms-confirmation-f657d77b6-dswwv Exec lifecycle hook ([pilot-agent wait]) for Container "istio-proxy" in Pod "ms-confirmation-f657d77b6-dswwv_isys-ndbo-stress(ed90d539-f584-4687-b027-adb054af313a)" failed - error: command 'pilot-agent wait' exited with 255: Error: timeout waiting for Envoy proxy to become ready. Last error: Get "http://localhost:15021/healthz/ready": dial tcp [::1]:15021: connect: connection refused...
48m Normal Killing pod/ms-confirmation-f657d77b6-dswwv FailedPostStartHook
49m Normal Pulling pod/ms-confirmation-f657d77b6-dswwv Pulling image "registry.rshbdev.ru/rshbintech/crft/dboul/ndbo/backend/core/ms-confirmation:stress"
49m Normal Pulled pod/ms-confirmation-f657d77b6-dswwv Successfully pulled image "registry.rshbdev.ru/rshbintech/crft/dboul/ndbo/backend/core/ms-confirmation:stress" in 50.49869ms
49m Normal Created pod/ms-confirmation-f657d77b6-dswwv Created container app
49m Normal Started pod/ms-confirmation-f657d77b6-dswwv Started container app
40m Normal SecretRotationComplete pod/ms-confirmation-f657d77b6-dswwv successfully rotated K8s secret ms-confirmation-app-secret-env
48m Warning FailedPostStartHook pod/ms-confirmation-f657d77b6-dswwv Exec lifecycle hook ([pilot-agent wait]) for Container "istio-proxy" in Pod "ms-confirmation-f657d77b6-dswwv_isys-ndbo-stress(ed90d539-f584-4687-b027-adb054af313a)" failed - error: command 'pilot-agent wait' exited with 255: Error: timeout waiting for Envoy proxy to become ready. Last error: Get "http://localhost:15021/healthz/ready": dial tcp [::1]:15021: connect: connection refused...
48m Warning BackOff pod/ms-confirmation-f657d77b6-dswwv Back-off restarting failed container
47m Warning Unhealthy pod/ms-confirmation-f657d77b6-dswwv Liveness probe failed: Get "http://100.79.158.202:15020/app-health/app/livez": dial tcp 100.79.158.202:15020: connect: invalid argument
47m Warning Unhealthy pod/ms-confirmation-f657d77b6-dswwv Readiness probe failed: Get "http://100.79.158.202:15020/app-health/app/readyz": dial tcp 100.79.158.202:15020: connect: invalid argument
44m Warning Unhealthy pod/ms-confirmation-f657d77b6-dswwv Readiness probe failed: HTTP probe failed with statuscode: 500
50m Normal SuccessfulCreate replicaset/ms-confirmation-f657d77b6 Created pod: ms-confirmation-f657d77b6-dswwv
40m Normal SuccessfulDelete replicaset/ms-confirmation-f657d77b6 Deleted pod: ms-confirmation-f657d77b6-dswwv
50m Normal ScalingReplicaSet deployment/ms-confirmation Scaled down replica set ms-confirmation-b5db7465 to 0
50m Normal ScalingReplicaSet deployment/ms-confirmation Scaled up replica set ms-confirmation-f657d77b6 to 1
40m Normal ScalingReplicaSet deployment/ms-confirmation Scaled down replica set ms-confirmation-f657d77b6 to 0
40m Normal ScalingReplicaSet deployment/ms-confirmation Scaled up replica set ms-confirmation-b5db7465 to 1
dmitriev-aal@VDI-Dmitriev-A:~$ kubectl get pods | grep ms-confirmation
ms-confirmation-b5db7465-nlxzr 1/2 Running 12 (5m11s ago) 40m
dmitriev-aal@VDI-Dmitriev-A:~$ kubectl describe pod ms-confirmation-b5db7465-nlxzr
Name: ms-confirmation-b5db7465-nlxzr
Namespace: isys-ndbo-stress
Priority: 0
Priority Class Name: rumsk1
Service Account: default
Node: afs1asd-wl-153/10.21.182.109
Start Time: Tue, 06 Oct 2026 09:51:01 +0300
Labels: app=ms-confirmation
chart=base-1.15.3
fullname=ms-confirmation
heritage=Helm
isys=ndbo-stress
pod-template-hash=b5db7465
psvc=ms-confirmation
release=ms-confirmation
security.istio.io/tlsMode=istio
service.istio.io/canonical-name=ms-confirmation
service.istio.io/canonical-revision=stress
version=stress
workload.topology.app.farm/zone=rumsk1
Annotations: checksum/configMapsEnv: e15e62dbc41d36f96fd09e3f544e874631db058a30e86b5156e83ad35e8076b1
checksum/secretEnv: 02ed2cff73c416c243ab27cce92dcc0ae5efacbb5a0d9cde11c45a1a49c0fe3b
ci/commithash: b9d7e33b
cni.projectcalico.org/containerID: 5970b06661ac47c7a0fccee9713c71bca2efaf69233eb8fbf9a463d5b1fb2e8e
cni.projectcalico.org/podIP: 100.79.158.212/32
cni.projectcalico.org/podIPs: 100.79.158.212/32
inject.istio.io/templates: sidecar,custom
kubectl.kubernetes.io/default-container: app
kubectl.kubernetes.io/default-logs-container: app
kubectl.kubernetes.io/restartedAt: 2025-09-10T00:58:04+03:00
prometheus.io/path: /stats/prometheus
prometheus.io/port: 15020
prometheus.io/scrape: true
sidecar.istio.io/proxyCPU: 200m
sidecar.istio.io/proxyCPULimit: 400m
sidecar.istio.io/proxyMemory: 256Mi
sidecar.istio.io/proxyMemoryLimit: 512Mi
sidecar.istio.io/status:
{"initContainers":["istio-init"],"containers":["istio-proxy"],"volumes":["istio-certs","workload-socket","credential-socket","workload-cer...
sidecar.istio.io/userVolume: [{"name": "wasmfilters-dir","configMap": {"name": "ndbo-stress-envoy-filters"}}]
sidecar.istio.io/userVolumeMount: [{"mountPath":"/var/local/lib/wasm-filters","name":"wasmfilters-dir"}]
Status: Running
IP: 100.79.158.212
IPs:
IP: 100.79.158.212
Controlled By: ReplicaSet/ms-confirmation-b5db7465
Init Containers:
istio-init:
Container ID: containerd://49de62069a23aebe99cb5632bc2acf4a21aee9fb60f700fcb118409dd73862ee
Image: registry.rshbdev.ru/appfarm/infra/images/istio/proxyv2:1.15.1-rshb.0.4.0
Image ID: registry.rshbdev.ru/appfarm/infra/images/istio/proxyv2@sha256:7b3ce834183d38c73388b93b9f2173957dba6da11f8bc17e8dfcd64415c41e4e
Port: <none>
Host Port: <none>
Args:
istio-iptables
-p
15001
-z
15006
-u
1337
-m
REDIRECT
-i
*
-x
-b
*
-d
15090,15021,15020
--log_output_level=default:info
State: Terminated
Reason: Completed
Exit Code: 0
Started: Tue, 06 Oct 2026 09:51:03 +0300
Finished: Tue, 06 Oct 2026 09:51:03 +0300
Ready: True
Restart Count: 0
Limits:
cpu: 400m
memory: 512Mi
Requests:
cpu: 200m
memory: 256Mi
Environment: <none>
Mounts: <none>
Containers:
istio-proxy:
Container ID: containerd://725736b7de7f64cfe4caca618c2a28c92625c230514313ad0b48c2b206ba0bce
Image: registry.rshbdev.ru/appfarm/infra/images/istio/proxyv2:1.15.1-rshb.0.4.0
Image ID: registry.rshbdev.ru/appfarm/infra/images/istio/proxyv2@sha256:7b3ce834183d38c73388b93b9f2173957dba6da11f8bc17e8dfcd64415c41e4e
Port: 15090/TCP (http-envoy-prom)
Host Port: 0/TCP (http-envoy-prom)
Args:
proxy
sidecar
--domain
$(POD_NAMESPACE).svc.cluster.local
--proxyLogLevel=warning
--proxyComponentLogLevel=misc:error
--log_output_level=default:info
--concurrency
2
State: Running
Started: Tue, 06 Oct 2026 09:52:11 +0300
Last State: Terminated
Reason: Completed
Exit Code: 0
Started: Tue, 06 Oct 2026 09:51:04 +0300
Finished: Tue, 06 Oct 2026 09:52:09 +0300
Ready: True
Restart Count: 1
Limits:
cpu: 400m
memory: 512Mi
Requests:
cpu: 200m
memory: 256Mi
Readiness: http-get http://:15021/healthz/ready delay=1s timeout=3s period=2s #success=1 #failure=30
Environment:
HTTP_LOG_FORWARDER_HOST: (v1:spec.nodeName)
HTTP_LOG_FORWARDER_PORT: 9000
HTTP_LOG_FORWARDER_ENDPOINT: /
OUTPUT_CERTS: /etc/istio-certs/
ISYS_NAME: (v1:metadata.labels['isys'])
PSVC_NAME: (v1:metadata.labels['psvc'])
WORKLOAD_ZONE_NAME: (v1:metadata.labels['workload.topology.app.farm/zone'])
JWT_POLICY: third-party-jwt
PILOT_CERT_PROVIDER: istiod
CA_ADDR: istiod.istio-system.svc:15012
POD_NAME: ms-confirmation-b5db7465-nlxzr (v1:metadata.name)
POD_NAMESPACE: isys-ndbo-stress (v1:metadata.namespace)
INSTANCE_IP: (v1:status.podIP)
SERVICE_ACCOUNT: (v1:spec.serviceAccountName)
HOST_IP: (v1:status.hostIP)
PROXY_CONFIG: {"tracing":{"zipkin":{"address":"jaeger-collector.istio-system:9411"},"customTags":{"workload.topology.app.farm/zone":{"environment":{"name":"WORKLOAD_ZONE_NAME"}}},"sampling":100}}
ISTIO_META_POD_PORTS: [
]
ISTIO_META_APP_CONTAINERS: app
ISTIO_META_CLUSTER_ID: Kubernetes
ISTIO_META_INTERCEPTION_MODE: REDIRECT
ISTIO_META_WORKLOAD_NAME: ms-confirmation
ISTIO_META_OWNER: kubernetes://apis/apps/v1/namespaces/isys-ndbo-stress/deployments/ms-confirmation
ISTIO_META_MESH_ID: cluster.local
TRUST_DOMAIN: cluster.local
ISTIO_PROMETHEUS_ANNOTATIONS: {"scrape":"true","path":"/metrics","port":"8080"}
ISTIO_KUBE_APP_PROBERS: {"/app-health/app/livez":{"httpGet":{"path":"/health/liveness","port":8080,"scheme":"HTTP"},"timeoutSeconds":1},"/app-health/app/readyz":{"httpGet":{"path":"/health/readiness","port":8080,"scheme":"HTTP"},"timeoutSeconds":1}}
Mounts:
/etc/istio-certs/ from istio-certs (rw)
/etc/istio/pod from istio-podinfo (rw)
/etc/istio/proxy from istio-envoy (rw)
/var/lib/istio/data from istio-data (rw)
/var/local/lib/wasm-filters from wasmfilters-dir (rw)
/var/run/secrets/credential-uds from credential-socket (rw)
/var/run/secrets/istio from istiod-ca-cert (rw)
/var/run/secrets/tokens from istio-token (rw)
/var/run/secrets/workload-spiffe-credentials from workload-certs (rw)
/var/run/secrets/workload-spiffe-uds from workload-socket (rw)
app:
Container ID: containerd://7cbd508d4aac1b29930b7d7da55d185f882dc78ffa63f5f14379d27e23f01b49
Image: registry.rshbdev.ru/rshbintech/crft/dboul/ndbo/backend/core/ms-confirmation:stress
Image ID: registry.rshbdev.ru/rshbintech/crft/dboul/ndbo/backend/core/ms-confirmation@sha256:b5f863a3f4e2ea0b4010d7329a938d76c9104a0256d7eefaa98a681d9903f15f
Port: <none>
Host Port: <none>
State: Running
Started: Tue, 06 Oct 2026 10:31:38 +0300
Last State: Terminated
Reason: Error
Exit Code: 143
Started: Tue, 06 Oct 2026 10:24:08 +0300
Finished: Tue, 06 Oct 2026 10:26:32 +0300
Ready: False
Restart Count: 11
Limits:
cpu: 800m
memory: 2Gi
Requests:
cpu: 500m
memory: 1Gi
Liveness: http-get http://:15020/app-health/app/livez delay=120s timeout=1s period=5s #success=1 #failure=5
Readiness: http-get http://:15020/app-health/app/readyz delay=120s timeout=1s period=5s #success=1 #failure=3
Environment Variables from:
ms-confirmation-app-cm-env ConfigMap Optional: false
ms-confirmation-app-secret-env Secret Optional: false
Environment: <none>
Mounts:
/secrets from app-vault-secrets (ro)
Conditions:
Type Status
Initialized True
Ready False
ContainersReady False
PodScheduled True
Volumes:
istio-certs:
Type: EmptyDir (a temporary directory that shares a pod's lifetime)
Medium: Memory
SizeLimit: <unset>
workload-socket:
Type: EmptyDir (a temporary directory that shares a pod's lifetime)
Medium:
SizeLimit: <unset>
credential-socket:
Type: EmptyDir (a temporary directory that shares a pod's lifetime)
Medium:
SizeLimit: <unset>
workload-certs:
Type: EmptyDir (a temporary directory that shares a pod's lifetime)
Medium:
SizeLimit: <unset>
istio-envoy:
Type: EmptyDir (a temporary directory that shares a pod's lifetime)
Medium: Memory
SizeLimit: <unset>
istio-data:
Type: EmptyDir (a temporary directory that shares a pod's lifetime)
Medium:
SizeLimit: <unset>
istio-podinfo:
Type: DownwardAPI (a volume populated by information about the pod)
Items:
metadata.labels -> labels
metadata.annotations -> annotations
istio-token:
Type: Projected (a volume that contains injected data from multiple sources)
TokenExpirationSeconds: 43200
istiod-ca-cert:
Type: ConfigMap (a volume populated by a ConfigMap)
Name: istio-ca-root-cert
Optional: false
wasmfilters-dir:
Type: ConfigMap (a volume populated by a ConfigMap)
Name: ndbo-stress-envoy-filters
Optional: false
app-vault-secrets:
Type: CSI (a Container Storage Interface (CSI) volume source)
Driver: secrets-store.csi.k8s.io
FSType:
ReadOnly: true
VolumeAttributes: secretProviderClass=ms-confirmation-app-secret-provider
QoS Class: Burstable
Node-Selectors: node-role.kubernetes.io/wload=
workload.topology.app.farm/zone=rumsk1
Tolerations: node-role.kubernetes.io/wload:NoSchedule op=Exists
node.kubernetes.io/not-ready:NoExecute op=Exists for 300s
node.kubernetes.io/unreachable:NoExecute op=Exists for 300s
workload.topology.app.farm/zone:NoSchedule op=Exists
Events:
Type Reason Age From Message
---- ------ ---- ---- -------
Normal Scheduled 40m default-scheduler Successfully assigned isys-ndbo-stress/ms-confirmation-b5db7465-nlxzr to afs1asd-wl-153
Normal Pulled 40m kubelet spec.initContainers{istio-init}: Container image "registry.rshbdev.ru/appfarm/infra/images/istio/proxyv2:1.15.1-rshb.0.4.0" already present on machine
Normal Created 40m kubelet spec.initContainers{istio-init}: Created container istio-init
Normal Started 40m kubelet spec.initContainers{istio-init}: Started container istio-init
Normal Killing 39m kubelet spec.containers{istio-proxy}: FailedPostStartHook
Warning FailedPostStartHook 39m kubelet spec.containers{istio-proxy}: Exec lifecycle hook ([pilot-agent wait]) for Container "istio-proxy" in Pod "ms-confirmation-b5db7465-nlxzr_isys-ndbo-stress(fdc00fa2-0bc7-43c6-80c4-3ed7660f04c6)" failed - error: command 'pilot-agent wait' exited with 255: Error: timeout waiting for Envoy proxy to become ready. Last error: Get "http://localhost:15021/healthz/ready": dial tcp [::1]:15021: connect: connection refused
, message: "2026-10-06T06:51:04.756718Z\tinfo\tWaiting for Envoy proxy to be ready (timeout: 60 seconds)...\n2026-10-06T06:52:04.758154Z\terror\ttimeout waiting for Envoy proxy to become ready. Last error: Get \"http://localhost:15021/healthz/ready\": dial tcp [::1]:15021: connect: connection refused\nError: timeout waiting for Envoy proxy to become ready. Last error: Get \"http://localhost:15021/healthz/ready\": dial tcp [::1]:15021: connect: connection refused\n"
Normal Pulled 39m kubelet spec.containers{app}: Successfully pulled image "registry.rshbdev.ru/rshbintech/crft/dboul/ndbo/backend/core/ms-confirmation:stress" in 71.724038ms
Normal Pulling 39m kubelet spec.containers{app}: Pulling image "registry.rshbdev.ru/rshbintech/crft/dboul/ndbo/backend/core/ms-confirmation:stress"
Normal Pulled 39m (x2 over 40m) kubelet spec.containers{istio-proxy}: Container image "registry.rshbdev.ru/appfarm/infra/images/istio/proxyv2:1.15.1-rshb.0.4.0" already present on machine
Normal Created 39m (x2 over 40m) kubelet spec.containers{istio-proxy}: Created container istio-proxy
Normal Created 39m kubelet spec.containers{app}: Created container app
Normal Started 39m kubelet spec.containers{app}: Started container app
Normal Started 39m (x2 over 40m) kubelet spec.containers{istio-proxy}: Started container istio-proxy
Warning Unhealthy 25m (x36 over 37m) kubelet spec.containers{app}: Readiness probe failed: HTTP probe failed with statuscode: 500
Warning Unhealthy 5m44s (x51 over 37m) kubelet spec.containers{app}: Liveness probe failed: HTTP probe failed with statuscode: 500
Normal SecretRotationComplete 78s (x20 over 39m) csi-secrets-store-rotation successfully rotated K8s secret ms-confirmation-app-secret-env
Warning BackOff 45s (x61 over 22m) kubelet spec.containers{app}: Back-off restarting failed container
dmitriev-aal@VDI-Dmitriev-A:~$ kubectl logs ms-confirmation-b5db7465-nlxzr
[Global flags]
int ActiveProcessorCount = -1 {product} {default}
uintx AdaptiveSizeDecrementScaleFactor = 4 {product} {default}
uintx AdaptiveSizeMajorGCDecayTimeScale = 10 {product} {default}
uintx AdaptiveSizePolicyCollectionCostMargin = 50 {product} {default}
uintx AdaptiveSizePolicyInitializingSteps = 20 {product} {default}
uintx AdaptiveSizePolicyOutputInterval = 0 {product} {default}
uintx AdaptiveSizePolicyWeight = 10 {product} {default}
uintx AdaptiveSizeThroughPutPolicy = 0 {product} {default}
uintx AdaptiveTimeWeight = 25 {product} {default}
bool AdjustStackSizeForTLS = false {product} {default}
bool AggressiveHeap = false {product} {default}
bool AlignVector = false {C2 product} {default}
ccstr AllocateHeapAt = {product} {default}
intx AllocateInstancePrefetchLines = 1 {product} {default}
intx AllocatePrefetchDistance = 256 {product} {default}
intx AllocatePrefetchInstr = 3 {product} {default}
intx AllocatePrefetchLines = 3 {product} {default}
intx AllocatePrefetchStepSize = 64 {product} {default}
intx AllocatePrefetchStyle = 1 {product} {default}
bool AllowParallelDefineClass = false {product} {default}
bool AllowRedefinitionToAddDeleteMethods = false {product} {default}
bool AllowUserSignalHandlers = false {product} {default}
bool AllowVectorizeOnDemand = true {C2 product} {default}
bool AlwaysActAsServerClassMachine = false {product} {default}
bool AlwaysCompileLoopMethods = false {product} {default}
bool AlwaysPreTouch = false {product} {default}
bool AlwaysRestoreFPU = false {product} {default}
bool AlwaysTenure = false {product} {default}
ccstr ArchiveClassesAtExit = {JVMCI product} {default}
intx ArrayCopyLoadStoreMaxElem = 8 {product} {default}
size_t AsyncLogBufferSize = 2097152 {product} {default}
intx AutoBoxCacheMax = 128 {C2 product} {default}
bool AutoCreateSharedArchive = false {JVMCI product} {default}
intx BCEATraceLevel = 0 {product} {default}
bool BackgroundCompilation = true {pd product} {default}
size_t BaseFootPrintEstimate = 268435456 {product} {default}
bool BlockLayoutByFrequency = true {C2 product} {default}
intx BlockLayoutMinDiamondPercentage = 20 {C2 product} {default}
bool BlockLayoutRotateLoops = true {C2 product} {default}
intx C1InlineStackLimit = 5 {C1 product} {default}
intx C1MaxInlineLevel = 9 {C1 product} {default}
intx C1MaxInlineSize = 35 {C1 product} {default}
intx C1MaxRecursiveInlineLevel = 1 {C1 product} {default}
intx C1MaxTrivialSize = 6 {C1 product} {default}
bool C1OptimizeVirtualCallProfiling = true {C2 product} {default}
bool C1ProfileBranches = true {C2 product} {default}
bool C1ProfileCalls = true {C2 product} {default}
bool C1ProfileCheckcasts = true {C2 product} {default}
bool C1ProfileInlinedCalls = true {C2 product} {default}
bool C1ProfileVirtualCalls = true {C2 product} {default}
bool C1UpdateMethodData = true {C2 product} {default}
intx CICompilerCount = 2 {product} {ergonomic}
bool CICompilerCountPerCPU = true {product} {default}
bool CITime = false {product} {default}
bool CheckJNICalls = false {product} {default}
bool ClassUnloading = true {product} {default}
bool ClassUnloadingWithConcurrentMark = true {product} {default}
bool ClipInlining = true {product} {default}
uintx CodeCacheExpansionSize = 65536 {pd product} {default}
bool CompactStrings = true {pd product} {default}
ccstr CompilationMode = default {product} {default}
ccstrlist CompileCommand = {product} {default}
ccstr CompileCommandFile = {product} {default}
ccstrlist CompileOnly = {product} {default}
intx CompileThreshold = 10000 {pd product} {default}
double CompileThresholdScaling = 1.000000 {product} {default}
int CompilerThreadPriority = -1 {product} {default}
intx CompilerThreadStackSize = 1024 {pd product} {default}
size_t CompressedClassSpaceSize = 1073741824 {product} {default}
uint ConcGCThreads = 0 {product} {default}
intx ConditionalMoveLimit = 3 {C2 pd product} {default}
intx ContendedPaddingWidth = 128 {product} {default}
bool CrashOnOutOfMemoryError = false {product} {default}
bool CreateCoredumpOnCrash = true {product} {default}
bool DTraceAllocProbes = false {product} {default}
bool DTraceMethodProbes = false {product} {default}
bool DTraceMonitorProbes = false {product} {default}
bool DisableAttachMechanism = false {product} {default}
bool DisableExplicitGC = false {product} {default}
bool DisplayVMOutputToStderr = false {product} {default}
bool DisplayVMOutputToStdout = false {product} {default}
bool DoEscapeAnalysis = true {C2 product} {default}
bool DoReserveCopyInSuperWord = true {C2 product} {default}
bool DontCompileHugeMethods = true {product} {default}
bool DontYieldALot = false {pd product} {default}
ccstr DumpLoadedClassList = {JVMCI product} {default}
bool DumpReplayDataOnError = true {product} {default}
bool EagerXrunInit = false {product} {default}
intx EliminateAllocationArraySizeLimit = 64 {C2 product} {default}
bool EliminateAllocations = true {C2 product} {default}
bool EliminateAutoBox = true {C2 product} {default}
bool EliminateLocks = true {C2 product} {default}
bool EliminateNestedLocks = true {C2 product} {default}
bool EnableContended = true {product} {default}
bool EnableDynamicAgentLoading = true {product} {default}
size_t ErgoHeapSizeLimit = 0 {product} {default}
ccstr ErrorFile = {product} {default}
bool ErrorFileToStderr = false {product} {default}
bool ErrorFileToStdout = false {product} {default}
uint64_t ErrorLogTimeout = 120 {product} {default}
double EscapeAnalysisTimeout = 20.000000 {C2 product} {default}
bool EstimateArgEscape = true {product} {default}
bool ExecutingUnitTests = false {product} {default}
bool ExitOnOutOfMemoryError = false {product} {default}
bool ExplicitGCInvokesConcurrent = false {product} {default}
bool ExtensiveErrorReports = false {product} {default}
ccstr ExtraSharedClassListFile = {JVMCI product} {default}
bool FlightRecorder = false {product} {default}
ccstr FlightRecorderOptions = {product} {default}
bool ForceTimeHighResolution = false {product} {default}
intx FreqInlineSize = 325 {C2 pd product} {default}
double G1ConcMarkStepDurationMillis = 10.000000 {product} {default}
uint G1ConcRefinementThreads = 0 {product} {default}
uintx G1ConfidencePercent = 50 {product} {default}
size_t G1HeapRegionSize = 0 {product} {default}
uintx G1HeapWastePercent = 5 {product} {default}
uintx G1MixedGCCountTarget = 8 {product} {default}
uintx G1PeriodicGCInterval = 0 {manageable} {default}
bool G1PeriodicGCInvokesConcurrent = true {product} {default}
double G1PeriodicGCSystemLoadThreshold = 0.000000 {manageable} {default}
intx G1RSetUpdatingPauseTimePercent = 10 {product} {default}
uint G1RefProcDrainInterval = 1000 {product} {default}
uintx G1ReservePercent = 10 {product} {default}
uintx G1SATBBufferEnqueueingThresholdPercent = 60 {product} {default}
size_t G1SATBBufferSize = 1024 {product} {default}
size_t G1UpdateBufferSize = 256 {product} {default}
bool G1UseAdaptiveIHOP = true {product} {default}
uint GCCardSizeInBytes = 512 {product} {default}
uintx GCDrainStackTargetSize = 64 {product} {default}
uintx GCHeapFreeLimit = 2 {product} {default}
uintx GCLockerEdenExpansionPercent = 5 {product} {default}
uintx GCPauseIntervalMillis = 0 {product} {default}
uintx GCTimeLimit = 98 {product} {default}
uintx GCTimeRatio = 99 {product} {default}
size_t HeapBaseMinAddress = 2147483648 {pd product} {default}
bool HeapDumpAfterFullGC = false {manageable} {default}
bool HeapDumpBeforeFullGC = false {manageable} {default}
intx HeapDumpGzipLevel = 0 {manageable} {default}
bool HeapDumpOnOutOfMemoryError = false {manageable} {default}
ccstr HeapDumpPath = {manageable} {default}
uintx HeapFirstMaximumCompactionCount = 3 {product} {default}
uintx HeapMaximumCompactionInterval = 20 {product} {default}
uintx HeapSearchSteps = 3 {product} {default}
size_t HeapSizePerGCThread = 43620760 {product} {default}
bool IgnoreEmptyClassPaths = false {product} {default}
bool IgnoreUnrecognizedVMOptions = false {product} {default}
uintx IncreaseFirstTierCompileThresholdAt = 50 {product} {default}
bool IncrementalInline = true {C2 product} {default}
uintx InitialCodeCacheSize = 2555904 {pd product} {default}
size_t InitialHeapSize = 33554432 {product} {ergonomic}
uintx InitialRAMFraction = 64 {product} {default}
double InitialRAMPercentage = 1.562500 {product} {default}
uintx InitialSurvivorRatio = 8 {product} {default}
uintx InitialTenuringThreshold = 7 {product} {default}
uintx InitiatingHeapOccupancyPercent = 45 {product} {default}
bool Inline = true {product} {default}
ccstr InlineDataFile = {product} {default}
intx InlineSmallCode = 2500 {C2 pd product} {default}
bool InlineSynchronizedMethods = true {C1 product} {default}
intx InteriorEntryAlignment = 16 {C2 pd product} {default}
intx InterpreterProfilePercentage = 33 {product} {default}
bool JavaMonitorsInStackTrace = true {product} {default}
int JavaPriority10_To_OSPriority = -1 {product} {default}
int JavaPriority1_To_OSPriority = -1 {product} {default}
int JavaPriority2_To_OSPriority = -1 {product} {default}
int JavaPriority3_To_OSPriority = -1 {product} {default}
int JavaPriority4_To_OSPriority = -1 {product} {default}
int JavaPriority5_To_OSPriority = -1 {product} {default}
int JavaPriority6_To_OSPriority = -1 {product} {default}
int JavaPriority7_To_OSPriority = -1 {product} {default}
int JavaPriority8_To_OSPriority = -1 {product} {default}
int JavaPriority9_To_OSPriority = -1 {product} {default}
size_t LargePageHeapSizeThreshold = 134217728 {product} {default}
size_t LargePageSizeInBytes = 0 {product} {default}
intx LiveNodeCountInliningCutoff = 40000 {C2 product} {default}
bool LoadExecStackDllInVMThread = true {product} {default}
intx LoopMaxUnroll = 16 {C2 product} {default}
intx LoopOptsCount = 43 {C2 product} {default}
intx LoopPercentProfileLimit = 10 {C2 pd product} {default}
uintx LoopStripMiningIter = 0 {product} {default}
uintx LoopStripMiningIterShortLoop = 0 {product} {default}
intx LoopUnrollLimit = 60 {C2 pd product} {default}
intx LoopUnrollMin = 4 {C2 product} {default}
bool LoopUnswitching = true {C2 product} {default}
bool ManagementServer = false {product} {default}
size_t MarkStackSize = 4194304 {product} {default}
size_t MarkStackSizeMax = 536870912 {product} {default}
uint MarkSweepAlwaysCompactCount = 4 {product} {default}
uintx MarkSweepDeadRatio = 5 {product} {default}
intx MaxBCEAEstimateLevel = 5 {product} {default}
intx MaxBCEAEstimateSize = 150 {product} {default}
uint64_t MaxDirectMemorySize = 0 {product} {default}
bool MaxFDLimit = true {product} {default}
uintx MaxGCMinorPauseMillis = 18446744073709551615 {product} {default}
uintx MaxGCPauseMillis = 18446744073709551614 {product} {default}
uintx MaxHeapFreeRatio = 70 {manageable} {default}
size_t MaxHeapSize = 1610612736 {product} {ergonomic}
intx MaxInlineLevel = 15 {C2 product} {default}
intx MaxInlineSize = 35 {C2 product} {default}
intx MaxJNILocalCapacity = 65536 {product} {default}
intx MaxJavaStackTraceDepth = 1024 {product} {default}
intx MaxJumpTableSize = 65000 {C2 product} {default}
intx MaxJumpTableSparseness = 5 {C2 product} {default}
intx MaxLabelRootDepth = 1100 {C2 product} {default}
intx MaxLoopPad = 11 {C2 product} {default}
size_t MaxMetaspaceExpansion = 5439488 {product} {default}
uintx MaxMetaspaceFreeRatio = 70 {product} {default}
size_t MaxMetaspaceSize = 18446744073709551615 {product} {default}
size_t MaxNewSize = 536870912 {product} {ergonomic}
intx MaxNodeLimit = 80000 {C2 product} {default}
uint64_t MaxRAM = 2147483648 {pd product} {ergonomic}
uintx MaxRAMFraction = 4 {product} {default}
double MaxRAMPercentage = 75.000000 {product} {command line}
intx MaxRecursiveInlineLevel = 1 {C2 product} {default}
uintx MaxTenuringThreshold = 15 {product} {default}
intx MaxTrivialSize = 6 {C2 product} {default}
intx MaxVectorSize = 64 {C2 product} {default}
size_t MetaspaceSize = 22020096 {product} {default}
bool MethodFlushing = true {product} {default}
size_t MinHeapDeltaBytes = 196608 {product} {ergonomic}
uintx MinHeapFreeRatio = 40 {manageable} {default}
size_t MinHeapSize = 8388608 {product} {ergonomic}
intx MinJumpTableSize = 10 {C2 pd product} {default}
size_t MinMetaspaceExpansion = 327680 {product} {default}
uintx MinMetaspaceFreeRatio = 40 {product} {default}
uintx MinRAMFraction = 2 {product} {default}
double MinRAMPercentage = 75.000000 {product} {command line}
uintx MinSurvivorRatio = 3 {product} {default}
size_t MinTLABSize = 2048 {product} {default}
intx MultiArrayExpandLimit = 6 {C2 product} {default}
uintx NUMAChunkResizeWeight = 20 {product} {default}
size_t NUMAInterleaveGranularity = 2097152 {product} {default}
uintx NUMAPageScanRate = 256 {product} {default}
size_t NUMASpaceResizeRate = 1073741824 {product} {default}
bool NUMAStats = false {product} {default}
ccstr NativeMemoryTracking = off {product} {default}
bool NeverActAsServerClassMachine = false {pd product} {default}
bool NeverTenure = false {product} {default}
uintx NewRatio = 2 {product} {default}
size_t NewSize = 11141120 {product} {ergonomic}
size_t NewSizeThreadIncrease = 5320 {pd product} {default}
intx NmethodSweepActivity = 4 {product} {default}
intx NodeLimitFudgeFactor = 2000 {C2 product} {default}
uintx NonNMethodCodeHeapSize = 5826188 {pd product} {ergonomic}
uintx NonProfiledCodeHeapSize = 122916026 {pd product} {ergonomic}
intx NumberOfLoopInstrToAlign = 4 {C2 product} {default}
int ObjectAlignmentInBytes = 8 {product lp64_product} {default}
size_t OldPLABSize = 1024 {product} {default}
size_t OldSize = 22413312 {product} {ergonomic}
bool OmitStackTraceInFastThrow = true {product} {default}
ccstrlist OnError = {product} {default}
ccstrlist OnOutOfMemoryError = {product} {default}
intx OnStackReplacePercentage = 140 {pd product} {default}
bool OptimizeFill = true {C2 product} {default}
bool OptimizePtrCompare = true {C2 product} {default}
bool OptimizeStringConcat = true {C2 product} {default}
bool OptoBundling = false {C2 pd product} {default}
intx OptoLoopAlignment = 16 {pd product} {default}
bool OptoRegScheduling = true {C2 pd product} {default}
bool OptoScheduling = false {C2 pd product} {default}
uintx PLABWeight = 75 {product} {default}
bool PSChunkLargeArrays = true {product} {default}
int ParGCArrayScanChunk = 50 {product} {default}
uintx ParallelGCBufferWastePct = 10 {product} {default}
uint ParallelGCThreads = 0 {product} {default}
size_t ParallelOldDeadWoodLimiterMean = 50 {product} {default}
size_t ParallelOldDeadWoodLimiterStdDev = 80 {product} {default}
bool ParallelRefProcBalancingEnabled = true {product} {default}
bool ParallelRefProcEnabled = false {product} {default}
bool PartialPeelAtUnsignedTests = true {C2 product} {default}
bool PartialPeelLoop = true {C2 product} {default}
intx PartialPeelNewPhiDelta = 0 {C2 product} {default}
uintx PausePadding = 1 {product} {default}
intx PerBytecodeRecompilationCutoff = 200 {product} {default}
intx PerBytecodeTrapLimit = 4 {product} {default}
intx PerMethodRecompilationCutoff = 400 {product} {default}
intx PerMethodTrapLimit = 100 {product} {default}
bool PerfAllowAtExitRegistration = false {product} {default}
bool PerfBypassFileSystemCheck = false {product} {default}
int PerfDataMemorySize = 32768 {product} {default}
intx PerfDataSamplingInterval = 50 {product} {default}
ccstr PerfDataSaveFile = {product} {default}
bool PerfDataSaveToFile = false {product} {default}
bool PerfDisableSharedMem = false {product} {default}
int PerfMaxStringConstLength = 1024 {product} {default}
size_t PreTouchParallelChunkSize = 4194304 {pd product} {default}
bool PreferInterpreterNativeStubs = false {pd product} {default}
intx PrefetchCopyIntervalInBytes = 576 {product} {default}
intx PrefetchScanIntervalInBytes = 576 {product} {default}
bool PreserveAllAnnotations = false {product} {default}
bool PreserveFramePointer = false {pd product} {default}
size_t PretenureSizeThreshold = 0 {product} {default}
bool PrintClassHistogram = false {manageable} {default}
bool PrintCodeCache = false {product} {default}
bool PrintCodeCacheOnCompilation = false {product} {default}
bool PrintCommandLineFlags = false {product} {default}
bool PrintCompilation = false {product} {default}
bool PrintConcurrentLocks = false {manageable} {default}
bool PrintExtendedThreadInfo = false {product} {default}
bool PrintFlagsFinal = true {product} {command line}
bool PrintFlagsInitial = false {product} {default}
bool PrintFlagsRanges = false {product} {default}
bool PrintGC = false {product} {default}
bool PrintGCDetails = false {product} {default}
bool PrintHeapAtSIGBREAK = true {product} {default}
bool PrintSharedArchiveAndExit = false {JVMCI product} {default}
bool PrintStringTableStatistics = false {product} {default}
bool PrintTieredEvents = false {product} {default}
bool PrintVMOptions = false {product} {default}
bool PrintWarnings = true {product} {default}
uintx ProcessDistributionStride = 4 {product} {default}
bool ProfileInterpreter = true {pd product} {default}
intx ProfileMaturityPercentage = 20 {product} {default}
uintx ProfiledCodeHeapSize = 122916026 {pd product} {ergonomic}
uintx PromotedPadding = 3 {product} {default}
uintx QueuedAllocationWarningCount = 0 {product} {default}
int RTMRetryCount = 5 {ARCH product} {default}
bool RangeCheckElimination = true {product} {default}
bool ReassociateInvariants = true {C2 product} {default}
bool RecordDynamicDumpInfo = false {JVMCI product} {default}
bool ReduceBulkZeroing = true {C2 product} {default}
bool ReduceFieldZeroing = true {C2 product} {default}
bool ReduceInitialCardMarks = true {C2 product} {default}
bool ReduceSignalUsage = false {product} {default}
bool RegisterFinalizersAtInit = true {product} {default}
bool RelaxAccessControlCheck = false {product} {default}
ccstr ReplayDataFile = {product} {default}
uintx ReservedCodeCacheSize = 251658240 {pd product} {ergonomic}
bool ResizePLAB = true {product} {default}
bool ResizeTLAB = true {product} {default}
bool RestoreMXCSROnJNICalls = false {product} {default}
bool RestrictContended = true {product} {default}
bool RestrictReservedStack = true {product} {default}
bool RewriteBytecodes = true {pd product} {default}
bool RewriteFrequentPairs = true {pd product} {default}
bool SafepointTimeout = false {product} {default}
intx SafepointTimeoutDelay = 10000 {product} {default}
bool ScavengeBeforeFullGC = false {product} {default}
bool SegmentedCodeCache = true {product} {ergonomic}
double SelfDestructTimer = 0.000000 {product} {default}
ccstr SharedArchiveConfigFile = {JVMCI product} {default}
ccstr SharedArchiveFile = {JVMCI product} {default}
size_t SharedBaseAddress = 140241167974400 {JVMCI product} {default}
ccstr SharedClassListFile = {JVMCI product} {default}
uint SharedSymbolTableBucketSize = 4 {JVMCI product} {default}
ccstr ShenandoahGCHeuristics = adaptive {product} {default}
ccstr ShenandoahGCMode = satb {product} {default}
bool ShowCodeDetailsInExceptionMessages = true {manageable} {default}
bool ShowMessageBoxOnError = false {product} {default}
bool ShrinkHeapInSteps = true {product} {default}
size_t SoftMaxHeapSize = 1610612736 {manageable} {ergonomic}
intx SoftRefLRUPolicyMSPerMB = 1000 {product} {default}
bool SplitIfBlocks = true {C2 product} {default}
intx StackRedPages = 1 {pd product} {default}
intx StackReservedPages = 1 {pd product} {default}
intx StackShadowPages = 20 {pd product} {default}
bool StackTraceInThrowable = true {product} {default}
intx StackYellowPages = 2 {pd product} {default}
uintx StartAggressiveSweepingAt = 10 {product} {default}
bool StartAttachListener = false {product} {default}
ccstr StartFlightRecording = {product} {default}
uint StringDeduplicationAgeThreshold = 3 {product} {default}
uintx StringTableSize = 65536 {product} {default}
bool SuperWordLoopUnrollAnalysis = true {C2 pd product} {default}
bool SuperWordReductions = true {C2 product} {default}
bool SuppressFatalErrorMessage = false {product} {default}
uintx SurvivorPadding = 3 {product} {default}
uintx SurvivorRatio = 8 {product} {default}
double SweeperThreshold = 15.000000 {product} {default}
uintx TLABAllocationWeight = 35 {product} {default}
uintx TLABRefillWasteFraction = 64 {product} {default}
size_t TLABSize = 0 {product} {default}
bool TLABStats = true {product} {default}
uintx TLABWasteIncrement = 4 {product} {default}
uintx TLABWasteTargetPercent = 1 {product} {default}
uintx TargetPLABWastePct = 10 {product} {default}
uintx TargetSurvivorRatio = 50 {product} {default}
uintx TenuredGenerationSizeIncrement = 20 {product} {default}
uintx TenuredGenerationSizeSupplement = 80 {product} {default}
uintx TenuredGenerationSizeSupplementDecay = 2 {product} {default}
int ThreadPriorityPolicy = 0 {product} {default}
bool ThreadPriorityVerbose = false {product} {default}
intx ThreadStackSize = 1024 {pd product} {default}
uintx ThresholdTolerance = 10 {product} {default}
intx Tier0BackedgeNotifyFreqLog = 10 {product} {default}
intx Tier0InvokeNotifyFreqLog = 7 {product} {default}
intx Tier0ProfilingStartPercentage = 200 {product} {default}
intx Tier23InlineeNotifyFreqLog = 20 {product} {default}
intx Tier2BackEdgeThreshold = 0 {product} {default}
intx Tier2BackedgeNotifyFreqLog = 14 {product} {default}
intx Tier2CompileThreshold = 0 {product} {default}
intx Tier2InvokeNotifyFreqLog = 11 {product} {default}
intx Tier3BackEdgeThreshold = 60000 {product} {default}
intx Tier3BackedgeNotifyFreqLog = 13 {product} {default}
intx Tier3CompileThreshold = 2000 {product} {default}
intx Tier3DelayOff = 2 {product} {default}
intx Tier3DelayOn = 5 {product} {default}
intx Tier3InvocationThreshold = 200 {product} {default}
intx Tier3InvokeNotifyFreqLog = 10 {product} {default}
intx Tier3LoadFeedback = 5 {product} {default}
intx Tier3MinInvocationThreshold = 100 {product} {default}
intx Tier4BackEdgeThreshold = 40000 {product} {default}
intx Tier4CompileThreshold = 15000 {product} {default}
intx Tier4InvocationThreshold = 5000 {product} {default}
intx Tier4LoadFeedback = 3 {product} {default}
intx Tier4MinInvocationThreshold = 600 {product} {default}
bool TieredCompilation = true {pd product} {default}
intx TieredCompileTaskTimeout = 50 {product} {default}
intx TieredRateUpdateMaxTime = 25 {product} {default}
intx TieredRateUpdateMinTime = 1 {product} {default}
intx TieredStopAtLevel = 4 {product} {default}
bool TimeLinearScan = false {C1 product} {default}
ccstr TraceJVMTI = {product} {default}
intx TrackedInitializationLimit = 50 {C2 product} {default}
bool TrapBasedNullChecks = false {pd product} {default}
bool TrapBasedRangeChecks = false {pd product} {default}
uint TrimNativeHeapInterval = 0 {product} {default}
intx TypeProfileArgsLimit = 2 {product} {default}
uint TypeProfileLevel = 111 {pd product} {default}
intx TypeProfileMajorReceiverPercent = 90 {C2 product} {default}
intx TypeProfileParmsLimit = 2 {product} {default}
intx TypeProfileWidth = 2 {product} {default}
int UnguardOnExecutionViolation = 0 {product} {default}
bool UseAES = true {product} {default}
int UseAVX = 3 {ARCH product} {default}
bool UseAdaptiveGenerationSizePolicyAtMajorCollection = true {product} {default}
bool UseAdaptiveGenerationSizePolicyAtMinorCollection = true {product} {default}
bool UseAdaptiveNUMAChunkSizing = true {product} {default}
bool UseAdaptiveSizeDecayMajorGCCost = true {product} {default}
bool UseAdaptiveSizePolicy = true {product} {default}
bool UseAdaptiveSizePolicyFootprintGoal = true {product} {default}
bool UseAdaptiveSizePolicyWithSystemGC = false {product} {default}
bool UseAddressNop = true {ARCH product} {default}
bool UseBASE64Intrinsics = true {product} {default}
bool UseBMI1Instructions = true {ARCH product} {default}
bool UseBMI2Instructions = true {ARCH product} {default}
bool UseBimorphicInlining = true {C2 product} {default}
bool UseCLMUL = true {ARCH product} {default}
bool UseCMoveUnconditionally = false {C2 product} {default}
bool UseCodeCacheFlushing = true {product} {default}
bool UseCompiler = true {product} {default}
bool UseCompressedClassPointers = true {product lp64_product} {default}
bool UseCompressedOops = true {product lp64_product} {ergonomic}
bool UseCondCardMark = false {product} {default}
bool UseContainerSupport = true {product} {default}
bool UseCountLeadingZerosInstruction = true {ARCH product} {default}
bool UseCountTrailingZerosInstruction = true {ARCH product} {default}
bool UseCountedLoopSafepoints = false {C2 product} {default}
bool UseCounterDecay = true {product} {default}
bool UseDivMod = true {C2 product} {default}
bool UseDynamicNumberOfCompilerThreads = true {product} {default}
bool UseDynamicNumberOfGCThreads = true {product} {default}
bool UseEmptySlotsInSupers = true {product} {default}
bool UseFMA = true {product} {default}
bool UseFPUForSpilling = true {C2 product} {default}
bool UseFastJNIAccessors = true {product} {default}
bool UseFastStosb = false {ARCH product} {default}
bool UseG1GC = false {product} {default}
bool UseGCOverheadLimit = true {product} {default}
bool UseHugeTLBFS = false {product} {default}
bool UseInlineCaches = true {product} {default}
bool UseInterpreter = true {product} {default}
bool UseJumpTables = true {C2 product} {default}
bool UseLargePages = true {pd product} {default}
bool UseLargePagesIndividualAllocation = false {pd product} {default}
bool UseLinuxPosixThreadCPUClocks = true {product} {default}
bool UseLoopCounter = true {product} {default}
bool UseLoopInvariantCodeMotion = true {C1 product} {default}
bool UseLoopPredicate = true {C2 product} {default}
bool UseMaximumCompactionOnSystemGC = true {product} {default}
bool UseNUMA = false {product} {default}
bool UseNUMAInterleaving = false {product} {default}
bool UseNewLongLShift = false {ARCH product} {default}
bool UseNotificationThread = true {product} {default}
bool UseOnStackReplacement = true {pd product} {default}
bool UseOnlyInlinedBimorphic = true {C2 product} {default}
bool UseOprofile = false {product} {default}
bool UsePSAdaptiveSurvivorSizePolicy = true {product} {default}
bool UseParallelGC = false {product} {default}
bool UsePerfData = true {product} {default}
bool UsePopCountInstruction = true {product} {default}
bool UseProfiledLoopPredicate = true {product} {default}
bool UseRTMDeopt = false {ARCH product} {default}
bool UseRTMLocking = false {ARCH product} {default}
bool UseSHA = true {product} {default}
bool UseSHM = false {product} {default}
int UseSSE = 4 {ARCH product} {default}
bool UseSSE42Intrinsics = true {ARCH product} {default}
bool UseSerialGC = true {product} {ergonomic}
bool UseShenandoahGC = false {product} {default}
bool UseSignalChaining = true {product} {default}
bool UseStoreImmI16 = false {ARCH product} {default}
bool UseStringDeduplication = false {product} {default}
bool UseSubwordForMaxVector = true {C2 product} {default}
bool UseSuperWord = true {C2 product} {default}
bool UseSystemMemoryBarrier = false {product} {default}
bool UseTLAB = true {product} {default}
bool UseThreadPriorities = true {pd product} {default}
bool UseTransparentHugePages = true {product} {command line}
bool UseTypeProfile = true {product} {default}
bool UseTypeSpeculation = true {product} {default}
bool UseUnalignedLoadStores = true {ARCH product} {default}
bool UseVectorCmov = false {C2 product} {default}
bool UseXMMForArrayCopy = true {product} {default}
bool UseXMMForObjInit = true {ARCH product} {default}
bool UseXmmI2D = false {ARCH product} {default}
bool UseXmmI2F = false {ARCH product} {default}
bool UseXmmLoadAndClearUpper = true {ARCH product} {default}
bool UseXmmRegToRegMoveAll = true {ARCH product} {default}
bool UseZGC = false {product} {default}
int VMThreadPriority = -1 {product} {default}
intx VMThreadStackSize = 1024 {pd product} {default}
intx ValueMapInitialSize = 11 {C1 product} {default}
intx ValueMapMaxLoopSize = 8 {C1 product} {default}
intx ValueSearchLimit = 1000 {C2 product} {default}
bool VerifySharedSpaces = false {JVMCI product} {default}
uintx YoungGenerationSizeIncrement = 20 {product} {default}
uintx YoungGenerationSizeSupplement = 80 {product} {default}
uintx YoungGenerationSizeSupplementDecay = 8 {product} {default}
size_t YoungPLABSize = 4096 {product} {default}
double ZAllocationSpikeTolerance = 2.000000 {product} {default}
double ZCollectionInterval = 0.000000 {product} {default}
double ZCollectionIntervalMajor = -1.000000 {product} {default}
double ZCollectionIntervalMinor = -1.000000 {product} {default}
bool ZCollectionIntervalOnly = false {product} {default}
double ZFragmentationLimit = 0.000000 {product} {default}
bool ZGenerational = false {product} {default}
size_t ZMarkStackSpaceLimit = 8589934592 {product} {default}
bool ZProactive = true {product} {default}
bool ZUncommit = true {product} {default}
uintx ZUncommitDelay = 300 {product} {default}
double ZYoungCompactionLimit = 25.000000 {product} {default}
bool ZeroTLAB = false {product} {default}
07:31:39.651 [main] INFO ru.rshbintech.crft.dboul.ndbo.backend.core.confirm.services.helper.CryptoproJCP -- Set CryptoPro JCP work directory: /tmp
Standard Commons Logging discovery in action with spring-jcl: please remove commons-logging.jar from classpath in order to avoid potential conflicts
. ____ _ __ _ _
/\\ / ___'_ __ _ _(_)_ __ __ _ \ \ \ \
( ( )\___ | '_ | '_| | '_ \/ _` | \ \ \ \
\\/ ___)| |_)| | | | | || (_| | ) ) ) )
' |____| .__|_| |_|_| |_\__, | / / / /
=========|_|==============|___/=/_/_/_/
:: Spring Boot :: (v3.1.2)
{"@timestamp":"2026-10-06T07:31:46.403+00:00","@version":"1","message":"Starting ConfirmationServiceApplication using Java 21.0.9 with PID 1 (/app/ms-confirmation.jar started by app in /app)","logger_name":"ru.rshbintech.crft.dboul.ndbo.backend.core.confirm.ConfirmationServiceApplication","thread_name":"main","level":"INFO","level_value":20000}
{"@timestamp":"2026-10-06T07:31:46.416+00:00","@version":"1","message":"Running with Spring Boot v3.1.2, Spring v6.0.11","logger_name":"ru.rshbintech.crft.dboul.ndbo.backend.core.confirm.ConfirmationServiceApplication","thread_name":"main","level":"DEBUG","level_value":10000}
{"@timestamp":"2026-10-06T07:31:46.418+00:00","@version":"1","message":"The following 1 profile is active: \"stress\"","logger_name":"ru.rshbintech.crft.dboul.ndbo.backend.core.confirm.ConfirmationServiceApplication","thread_name":"main","level":"INFO","level_value":20000}
{"@timestamp":"2026-10-06T07:31:56.694+00:00","@version":"1","message":"Bean 'clientProperties' of type [ru.rshbintech.crft.dboul.ndbo.backend.core.employee.access.control.config.properties.ClientProperties$$SpringCGLIB$$0] is not eligible for getting processed by all BeanPostProcessors (for example: not eligible for auto-proxying)","logger_name":"org.springframework.context.support.PostProcessorRegistrationDelegate$BeanPostProcessorChecker","thread_name":"main","level":"INFO","level_value":20000}
{"@timestamp":"2026-10-06T07:31:56.726+00:00","@version":"1","message":"Bean 'expressionHandler' of type [ru.rshbintech.crft.dboul.ndbo.backend.core.employee.access.control.security.handler.ExpressionHandler] is not eligible for getting processed by all BeanPostProcessors (for example: not eligible for auto-proxying)","logger_name":"org.springframework.context.support.PostProcessorRegistrationDelegate$BeanPostProcessorChecker","thread_name":"main","level":"INFO","level_value":20000}
{"@timestamp":"2026-10-06T07:31:59.391+00:00","@version":"1","message":"Tomcat initialized with port(s): 8080 (http)","logger_name":"org.springframework.boot.web.embedded.tomcat.TomcatWebServer","thread_name":"main","level":"INFO","level_value":20000}
{"@timestamp":"2026-10-06T07:31:59.408+00:00","@version":"1","message":"Initializing ProtocolHandler [\"http-nio-8080\"]","logger_name":"org.apache.coyote.http11.Http11NioProtocol","thread_name":"main","level":"INFO","level_value":20000}
{"@timestamp":"2026-10-06T07:31:59.413+00:00","@version":"1","message":"Starting service [Tomcat]","logger_name":"org.apache.catalina.core.StandardService","thread_name":"main","level":"INFO","level_value":20000}
{"@timestamp":"2026-10-06T07:31:59.413+00:00","@version":"1","message":"Starting Servlet engine: [Apache Tomcat/10.1.11]","logger_name":"org.apache.catalina.core.StandardEngine","thread_name":"main","level":"INFO","level_value":20000}
{"@timestamp":"2026-10-06T07:31:59.527+00:00","@version":"1","message":"Initializing Spring embedded WebApplicationContext","logger_name":"org.apache.catalina.core.ContainerBase.[Tomcat].[localhost].[/]","thread_name":"main","level":"INFO","level_value":20000}
{"@timestamp":"2026-10-06T07:31:59.529+00:00","@version":"1","message":"Root WebApplicationContext: initialization completed in 13020 ms","logger_name":"org.springframework.boot.web.servlet.context.ServletWebServerApplicationContext","thread_name":"main","level":"INFO","level_value":20000}
Standard Commons Logging discovery in action with spring-jcl: please remove commons-logging.jar from classpath in order to avoid potential conflicts
dmitriev-aal@VDI-Dmitriev-A:~$
Running with gitlab-runner 15.8.0 (12335144)
on gitlab-runner-gitlab-runner-6f4d49d99-h585b 8W3Nm2Mz, system ID: r_DYVWgNUEigZr
Preparing the "kubernetes" executor
00:00
Using Kubernetes namespace: gitlab-runners
Using Kubernetes executor with image registry.rshbdev.ru/appfarm/infra/images/kube-client-apps:8.21.18 ...
Using attach strategy to execute scripts...
Preparing environment
00:06
Waiting for pod gitlab-runners/runner-8w3nm2mz-project-2935-concurrent-0dk2h6 to be running, status is Pending
Waiting for pod gitlab-runners/runner-8w3nm2mz-project-2935-concurrent-0dk2h6 to be running, status is Pending
ContainersNotReady: "containers with unready status: [build helper]"
ContainersNotReady: "containers with unready status: [build helper]"
Running on runner-8w3nm2mz-project-2935-concurrent-0dk2h6 via gitlab-runner-gitlab-runner-6f4d49d99-h585b...
Getting source from Git repository
00:03
$ git config --global --add url."https://gitlab-ci-token:${CI_JOB_TOKEN}@${CI_SERVER_HOST}/".insteadOf "https://${CI_SERVER_HOST}" # collapsed multi-line command
Fetching changes with git depth set to 50...
Initialized empty Git repository in /builds/rshbintech/crft/dboul/ndbo/backend/core/ms-confirmation/.git/
Created fresh repository.
Checking out 08934ea9 as stress...
Skipping Git submodules setup
Downloading artifacts
00:01
Downloading artifacts for dockerfilegen (25217875)...
Downloading artifacts from coordinator... ok id=25217875 responseStatus=200 OK token=64_YQ7Ka
Downloading artifacts for devsecops_antivirus_scan (25217874)...
Downloading artifacts from coordinator... ok id=25217874 responseStatus=200 OK token=64_YQ7Ka
Downloading artifacts for build (25217876)...
Downloading artifacts from coordinator... ok id=25217876 responseStatus=200 OK token=64_YQ7Ka
Downloading artifacts for unit (25218217)...
Downloading artifacts from coordinator... ok id=25218217 responseStatus=200 OK token=64_YQ7Ka
Executing "step_script" stage of the job script
20:43
$ ( umask 0077; mkdir -p ~/.kube && echo "$KUBECONFIG_COMBINED" | base64 -d > ~/.kube/config )
$ if [[ ${IS_SENSITIVE_SYSTEM} = true ]]; then export K8S_CLUSTERS=$K8S_CLUSTERS_SENSITIVE; fi
$ echo 'IS_SENSITIVE_SYSTEM:' $IS_SENSITIVE_SYSTEM
IS_SENSITIVE_SYSTEM: true
$ echo 'TARGET_CLUSTERS:' $K8S_CLUSTERS
TARGET_CLUSTERS: rcsdstbl
$ set -x
++ echo '$ for CLUSTER in $K8S_CLUSTERS; do'
$ for CLUSTER in $K8S_CLUSTERS; do
++ for CLUSTER in $K8S_CLUSTERS
++ echo '$ export CLUSTER=$CLUSTER'
$ export CLUSTER=$CLUSTER
++ export CLUSTER=rcsdstbl
++ CLUSTER=rcsdstbl
++ echo '$ if [[ ${CI_ENVIRONMENT_SLUG} = production ]]; then export NAMESPACE=isys-${ISYS_NAME}; else export NAMESPACE=isys-${ISYS_NAME}-${CI_ENVIRONMENT_SLUG}; fi'
$ if [[ ${CI_ENVIRONMENT_SLUG} = production ]]; then export NAMESPACE=isys-${ISYS_NAME}; else export NAMESPACE=isys-${ISYS_NAME}-${CI_ENVIRONMENT_SLUG}; fi
++ [[ stress = production ]]
++ export NAMESPACE=isys-ndbo-stress
++ NAMESPACE=isys-ndbo-stress
++ echo '$ read -r REVISION STATUS < <(helm --kube-context ${CLUSTER:-default} -n $NAMESPACE history $CI_PROJECT_NAME | tail -1 | cut -f1,3) || true'
$ read -r REVISION STATUS < <(helm --kube-context ${CLUSTER:-default} -n $NAMESPACE history $CI_PROJECT_NAME | tail -1 | cut -f1,3) || true
++ read -r REVISION STATUS
+++ helm --kube-context rcsdstbl -n isys-ndbo-stress history ms-confirmation
+++ tail -1
+++ cut -f1,3
++ echo '$ if [[ "$STATUS" =~ "pending" ]]; then helm --kube-context ${CLUSTER:-default} -n $NAMESPACE rollback $CI_PROJECT_NAME $REVISION || true; fi'
$ if [[ "$STATUS" =~ "pending" ]]; then helm --kube-context ${CLUSTER:-default} -n $NAMESPACE rollback $CI_PROJECT_NAME $REVISION || true; fi
++ [[ failed =~ pending ]]
++ echo '$ helmfile ${HELMFILE_DEFAULT_NAMESPACE:+--namespace $HELMFILE_DEFAULT_NAMESPACE} --environment ${CLUSTER:-default} -f deploy/helmfile.yaml --log-level info apply --suppress-secrets --set "additionalWorkloadAnnotations.gitlabPipeline=${CI_PIPELINE_URL}" --set "additionalWorkloadAnnotations.gitlabCommit=${CI_COMMIT_SHA}"'
$ helmfile ${HELMFILE_DEFAULT_NAMESPACE:+--namespace $HELMFILE_DEFAULT_NAMESPACE} --environment ${CLUSTER:-default} -f deploy/helmfile.yaml --log-level info apply --suppress-secrets --set "additionalWorkloadAnnotations.gitlabPipeline=${CI_PIPELINE_URL}" --set "additionalWorkloadAnnotations.gitlabCommit=${CI_COMMIT_SHA}"
++ helmfile --environment rcsdstbl -f deploy/helmfile.yaml --log-level info apply --suppress-secrets --set additionalWorkloadAnnotations.gitlabPipeline=https://gitlab.rshbdev.ru/rshbintech/crft/dboul/ndbo/backend/core/ms-confirmation/-/pipelines/3623193 --set additionalWorkloadAnnotations.gitlabCommit=08934ea91e1a3cc51eb013e6342e325d26766069
== /usr/local/link/helmfile: Initialize base deploy hierarchy in /builds/rshbintech/crft/dboul/ndbo/backend/core/ms-confirmation
no matches for path: envs/stress/rcsdstbl/helmfile.yaml.gotmpl
Adding repo rshb-charts https://nexus.rshbdev.ru/repository/charts/
"rshb-charts" has been added to your repositories
Comparing release=vault-secrets-ms-confirmation, chart=rshb-charts/raw
Comparing release=psvc-ms-confirmation, chart=rshb-charts/raw
Comparing release=platform-database-ms-confirmation, chart=rshb-charts/raw
Comparing release=links-ms-confirmation, chart=rshb-charts/raw
Comparing release=ms-confirmation, chart=rshb-charts/base
isys-ndbo-stress, ms-confirmation, Deployment (apps) has changed:
# Source: base/templates/workload.yaml
apiVersion: apps/v1
kind: Deployment
metadata:
name: ms-confirmation
labels:
app: ms-confirmation
fullname: ms-confirmation
chart: base-1.15.3
release: ms-confirmation
heritage: Helm
isys: "ndbo-stress"
psvc: "ms-confirmation"
version: "stress"
workload.topology.app.farm/zone: "rumsk1"
annotations:
- gitlabCommit: b9d7e33b3fd054523169b38f4a199a05bc436815
- gitlabPipeline: https://gitlab.rshbdev.ru/rshbintech/crft/dboul/ndbo/backend/core/ms-confirmation/-/pipelines/3437764
- platform.ckpr.integrations.rshbintech.ru/gitlab-commit-sha: b9d7e33b
- platform.ckpr.integrations.rshbintech.ru/gitlab-pipeline-id: "3437764"
+ gitlabCommit: 08934ea91e1a3cc51eb013e6342e325d26766069
+ gitlabPipeline: https://gitlab.rshbdev.ru/rshbintech/crft/dboul/ndbo/backend/core/ms-confirmation/-/pipelines/3623193
+ platform.ckpr.integrations.rshbintech.ru/gitlab-commit-sha: 08934ea9
+ platform.ckpr.integrations.rshbintech.ru/gitlab-pipeline-id: "3623193"
spec:
strategy:
type: Recreate
replicas: 1
selector:
matchLabels:
app: ms-confirmation
fullname: ms-confirmation
release: ms-confirmation
template:
metadata:
labels:
app: ms-confirmation
fullname: ms-confirmation
chart: base-1.15.3
release: ms-confirmation
heritage: Helm
isys: "ndbo-stress"
psvc: "ms-confirmation"
version: "stress"
workload.topology.app.farm/zone: "rumsk1"
annotations:
- checksum/configMapsEnv: "e15e62dbc41d36f96fd09e3f544e874631db058a30e86b5156e83ad35e8076b1"
+ checksum/configMapsEnv: "fcf8beb9c93d0feafc287f4370f6bf1070033a8cd559d43152e8d368b77b6408"
checksum/secretEnv: "02ed2cff73c416c243ab27cce92dcc0ae5efacbb5a0d9cde11c45a1a49c0fe3b"
- ci/commithash: "b9d7e33b"
+ ci/commithash: "08934ea9"
inject.istio.io/templates: "sidecar,custom"
prometheus.io/path: "/metrics"
prometheus.io/port: "8080"
prometheus.io/scrape: "true"
sidecar.istio.io/proxyCPU: "200m"
sidecar.istio.io/proxyCPULimit: "400m"
sidecar.istio.io/proxyMemory: "256Mi"
sidecar.istio.io/proxyMemoryLimit: "512Mi"
sidecar.istio.io/userVolume: "[{\"name\": \"wasmfilters-dir\",\"configMap\": {\"name\": \"ndbo-stress-envoy-filters\"}}]"
sidecar.istio.io/userVolumeMount: "[{\"mountPath\":\"/var/local/lib/wasm-filters\",\"name\":\"wasmfilters-dir\"}]"
spec:
automountServiceAccountToken: false
serviceAccountName: default
nodeSelector:
node-role.kubernetes.io/wload: ""
workload.topology.app.farm/zone: rumsk1
priorityClassName: rumsk1
containers:
- name: app
image: registry.rshbdev.ru/rshbintech/crft/dboul/ndbo/backend/core/ms-confirmation:stress
imagePullPolicy: Always
envFrom:
- configMapRef:
name: ms-confirmation-app-cm-env
- secretRef:
name: ms-confirmation-app-secret-env
resources:
limits:
cpu: 800m
memory: 2Gi
requests:
cpu: 500m
memory: 1Gi
ports:
livenessProbe:
failureThreshold: 5
httpGet:
path: /health/liveness
port: 8080
initialDelaySeconds: 120
periodSeconds: 5
successThreshold: 1
timeoutSeconds: 1
readinessProbe:
failureThreshold: 3
httpGet:
path: /health/readiness
port: 8080
initialDelaySeconds: 120
periodSeconds: 5
successThreshold: 1
timeoutSeconds: 1
volumeMounts:
- name: app-vault-secrets
mountPath: /secrets
readOnly: true
securityContext:
allowPrivilegeEscalation: false
capabilities:
drop:
- ALL
privileged: false
procMount: Default
readOnlyRootFilesystem: false
runAsGroup: 1001
runAsNonRoot: true
runAsUser: 1001
securityContext:
fsGroup: 1001
fsGroupChangePolicy: OnRootMismatch
runAsGroup: 1001
runAsNonRoot: true
runAsUser: 1001
tolerations:
- effect: NoSchedule
key: node-role.kubernetes.io/wload
operator: Exists
- effect: NoSchedule
key: workload.topology.app.farm/zone
operator: Exists
hostNetwork: false
volumes:
- name: app-vault-secrets
csi:
driver: secrets-store.csi.k8s.io
readOnly: true
volumeAttributes:
secretProviderClass: ms-confirmation-app-secret-provider
isys-ndbo-stress, ms-confirmation-app-cm-env, ConfigMap (v1) has changed:
# Source: base/templates/cm-env.yaml
apiVersion: v1
kind: ConfigMap
metadata:
name: ms-confirmation-app-cm-env
labels:
app: ms-confirmation
fullname: ms-confirmation
chart: base-1.15.3
release: ms-confirmation
heritage: Helm
isys: "ndbo-stress"
psvc: "ms-confirmation"
version: "stress"
workload.topology.app.farm/zone: "rumsk1"
data:
ACCESS_CONTROL_PERMISSION_REPLICATION_TOPIC: "plt_rb-access-control_actor-permission_pub"
APP_POSTGRESQL_HOST: "10.19.54.14"
APP_POSTGRESQL_NAME: "ndbo-stress"
APP_POSTGRESQL_PORT: "5432"
APP_POSTGRESQL_SCHEMA: "confirm"
CERTIFICATE_REGISTRY_API_URL: "http://ms-certificate-registry.isys-ndbo-stress"
CHECK_SIGN_ISO_PUB: "plt_ms-confirmation_check-iso20022_pub"
CHECK_SIGN_PUB: "plt_ms-confirmation_signatures-check_pub"
CHECK_SIGN_REQ: "plt_ms-confirmation_signatures-check_req"
CHECK_VISE_SIGN_PUB: "plt_ms-confirmation_signatures-vise_check_pub"
CHECK_VISE_SIGN_REQ: "plt_ms-confirmation_signatures-vise_check_req"
CORS-ALLOWED-ORIGIN-LIST: "https://portal.rshbdev.ru,https://react-ui.ndbo.dev.rshbdev.ru,https://react-ui.ndbo.rc.rshbdev.ru,https://react-ui.ndbo.rshbdev.ru,http://rshb.local:3000,http://127.0.0.1:8080,,https://test01.rshb.ru,https://test01.rshb.ru:444,https://dev-ikul.rshb.ru,https://business.rshb.ru,https://next.rshb.ru"
CRYPTO_SRV_HOST: "10.21.49.14"
CRYPTO_SRV_PORT: "17171"
DBOUL_MONOLITH_API_URL: "http://10.19.54.16:7777/ib6_new"
ENCODING_API_URL: ""
GET_CCB_PUB: "plt_ms-confirmation_ccb-build_pub"
GET_CCB_REQ: "plt_ms-confirmation_ccb-build_req"
HAZELCAST_CLIENT_LABEL: "ms-confirmation"
HAZELCAST_CLUSTER_MEMBERS: "10.19.54.52:5701, 10.19.54.52:5702, 10.19.54.52:5703"
HAZELCAST_CLUSTER_NAME: "stress"
HAZELCAST_SMART_ROUTING: "true"
- JAVA_OPTS: "-XX:+PrintFlagsFinal -XX:MaxRAMPercentage=75.0 -XX:MinRAMPercentage=75.0 -XX:+UseTransparentHugePages"
+ JAVA_OPTS: "-XX:MaxRAMPercentage=75.0 -XX:MinRAMPercentage=75.0 -XX:+AlwaysActAsServerClassMachine"
KAFKA_BOOTSTRAP: "10.21.49.28:9192,10.21.49.34:9192"
KAFKA_GROUP_ID: "ndbo-ms-confirmation-stress"
KAFKA_INNER_TOPIC: "plt_ms-confirmation_req_processing_pub"
KAFKA_SETTINGS_PUB: "plt_settings_pub"
KAFKA_SETTINGS_REQ: "plt_settings_cmd_req"
LIQUIBASE_ENABLED: "true"
LOGGING_LEVEL_RU_RSHBINTECH: "trace"
ODA_URL: "http://ms-org-delegate-authority"
+ ORGREG_ONE_WINDOW_REPLICATION_TOPIC: "plt_client-registry_one-window-groups_pub"
ORGREG_REPLICATION_TOPIC: "plt_client-registry_client_pub"
ORGREG_URL: "http://ms-org-registry"
OTP_API_URL: "http://ms-otp-stub.isys-ndbo-stress"
PAYCONTROL_API_CALLBACK_URL: "http://ms-confirmation/api/confirmation/v1/internal/paycontrol/transaction/result"
PAYCONTROL_API_URL: "http://paycontrol-stub/pc-api"
PAYCONTROL_DEVICE_REPLICATION_TOPIC: "plt_users_pc_device_pub"
PROFILE: "stress"
QRADAR_TOPIC: "plt_audit_cmd_req"
RBAC_URL: "http://ms-rb-access-control"
REVOKE_SIGN_PUB: "plt_ms-confirmation_revoke-sign_pub"
SIGN_CLIENT_INIT_PUB: "plt_ms-confirmation_confirm_pub_init_v2"
SIGN_CLIENT_PUB: "plt_ms-confirmation_confirm_pub_v2"
SIGN_EMPLOYEE_INIT_PUB: "plt_ms-confirmation_confirm_bank_user_pub_init_v2"
SIGN_EMPLOYEE_PUB: "plt_ms-confirmation_confirm_bank_user_pub_v2"
SMS_CODE_CONFIRM_ATTEMPTS: "9999"
SMS_CODE_GENERATE_BLOCK_TIMEOUT_SEC: "0"
SMS_CODE_GENERATE_MAX_ATTEMPTS: "9999"
USERS_REPLICATION_TOPIC: "plt_all_users_pub"
USERS_URL: "http://users"
USE_EMBEDDED_HAZELCAST: "false"
Listing releases matching ^pjob-ms-confirmation$
Listing releases matching ^exsvc-ms-confirmation$
Listing releases matching ^data-ms-confirmation$
Listing releases matching ^assets-config-ms-confirmation$
Listing releases matching ^ms-confirmation-raw$
Listing releases matching ^ms-confirmation-grafana-dashboard$
Listing releases matching ^ms-confirmation-prometheus-rules$
Listing releases matching ^ms-confirmation-rumsk1$
Listing releases matching ^ms-confirmation-rumsk2$
Upgrading release=ms-confirmation, chart=rshb-charts/base
FAILED RELEASES:
NAME
ms-confirmation
in deploy/helmfile.yaml: failed processing release ms-confirmation: command "/usr/local/link/helm" exited with non-zero status:
PATH:
/usr/local/link/helm
ARGS:
0: helm (4 bytes)
1: --kube-context (14 bytes)
2: rcsdstbl (8 bytes)
3: upgrade (7 bytes)
4: --install (9 bytes)
5: --reset-values (14 bytes)
6: ms-confirmation (15 bytes)
7: rshb-charts/base (16 bytes)
8: --version (9 bytes)
9: 1.15.3 (6 bytes)
10: --wait (6 bytes)
11: --timeout (9 bytes)
12: 600s (4 bytes)
13: --atomic (8 bytes)
14: --kube-context (14 bytes)
15: rcsdstbl (8 bytes)
16: --namespace (11 bytes)
17: isys-ndbo-stress (16 bytes)
18: --values (8 bytes)
19: /tmp/helmfile3245402630/isys-ndbo-stress-ms-confirmation-values-68d9dd878 (73 bytes)
20: --values (8 bytes)
21: /tmp/helmfile1425021141/isys-ndbo-stress-ms-confirmation-values-68cdc4c545 (74 bytes)
22: --set (5 bytes)
23: additionalWorkloadAnnotations.gitlabPipeline=https://gitlab.rshbdev.ru/rshbintech/crft/dboul/ndbo/backend/core/ms-confirmation/-/pipelines/3623193 (146 bytes)
24: --set (5 bytes)
25: additionalWorkloadAnnotations.gitlabCommit=08934ea91e1a3cc51eb013e6342e325d26766069 (83 bytes)
26: --history-max (13 bytes)
27: 10 (2 bytes)
ERROR:
exit status 1
EXIT STATUS
1
STDERR:
Error: UPGRADE FAILED: an error occurred while rolling back the release. original upgrade error: timed out waiting for the condition: release ms-confirmation failed: timed out waiting for the condition
COMBINED OUTPUT:
Error: UPGRADE FAILED: an error occurred while rolling back the release. original upgrade error: timed out waiting for the condition: release ms-confirmation failed: timed out waiting for the condition
Uploading artifacts for failed job
00:01
Uploading artifacts...
deploy.env: found 1 matching artifact files and directories
Uploading artifacts as "dotenv" to coordinator... 201 Created id=25224162 responseStatus=201 Created token=64_YQ7Ka
Cleaning up project directory and file based variables
00:00
ERROR: Job failed: command terminated with exit code 1