Загрузка данных
Running with gitlab-runner 15.8.0 (12335144)
on gitlab-runner-gitlab-runner-695bb55d66-shwwf y_Hs9d7d, system ID: r_unkj9zgbP7CT
Preparing the "kubernetes" executor
00:00
Using Kubernetes namespace: gitlab-runners
Using Kubernetes executor with image registry.rshbdev.ru/rshbintech/integrations/ckpr/infra/util/buildkit-journey:1.4.2 ...
Using attach strategy to execute scripts...
Preparing environment
00:07
Waiting for pod gitlab-runners/runner-yhs9d7d-project-49513-concurrent-0gl65v to be running, status is Pending
Waiting for pod gitlab-runners/runner-yhs9d7d-project-49513-concurrent-0gl65v to be running, status is Pending
ContainersNotReady: "containers with unready status: [build helper svc-0 svc-1]"
ContainersNotReady: "containers with unready status: [build helper svc-0 svc-1]"
Running on runner-yhs9d7d-project-49513-concurrent-0gl65v via gitlab-runner-gitlab-runner-695bb55d66-shwwf...
Getting source from Git repository
00:10
$ git config --global --add url."https://gitlab-ci-token:${CI_JOB_TOKEN}@${CI_SERVER_HOST}/".insteadOf "https://${CI_SERVER_HOST}" # collapsed multi-line command
Fetching changes with git depth set to 20...
Initialized empty Git repository in /builds/rshbintech/retail/crm-systems/efrfl-ocrm/communication-service/.git/
Created fresh repository.
Checking out 94d4397a as feature/ECO_DCC-738-fix...
Skipping Git submodules setup
Downloading artifacts
00:01
Downloading artifacts for dockerfilegen (24490264)...
Downloading artifacts from coordinator... ok id=24490264 responseStatus=200 OK token=64_KKp_4
Executing "step_script" stage of the job script
02:42
$ mkdir -p src
$ if [ -n "$CI_COMMIT_TAG" ] && [ "$BUILDKIT_PUBLISH" ]; then export BUILDKIT_CLIENT_OUTPUT=$CI_REGISTRY/$CI_PROJECT_PATH:$CI_COMMIT_TAG; fi
$ if [ -n "$BUILDKIT_CLIENT_BUILD_ARTIFACTS" ]; then export BUILDKIT_CLIENT_BUILD_ARTIFACTS_DESTINATION=$CI_CACHE_REGISTRY/buildkit-cache/$CI_PROJECT_PATH:$CI_COMMIT_SHA-$CI_JOB_NAME_SLUG-artifacts; fi
$ /buildkit-journey client
> [INFO] Команда для запуска: buildctl --tlscert /mtls/client/tls.crt --tlskey /mtls/client/tls.key --tlscacert /mtls/client/ca.crt --addr tcp://localhost:2323 build --progress auto --frontend dockerfile.v0 --local context=. --local dockerfile=. --opt target=test --output type=image,compression=gzip,push=true,name=registry-cache.rshbdev.ru/buildkit-cache/rshbintech/retail/crm-systems/efrfl-ocrm/communication-service:94d4397aac7b64ec7acf5ecc4917602a10714a4a-unit-artifacts --import-cache type=registry,ref=registry-cache.rshbdev.ru/buildkit-cache/rshbintech/retail/crm-systems/efrfl-ocrm/communication-service:94d4397aac7b64ec7acf5ecc4917602a10714a4a --import-cache type=registry,ref=registry-cache.rshbdev.ru/buildkit-cache/rshbintech/retail/crm-systems/efrfl-ocrm/communication-service:94d4397aac7b64ec7acf5ecc4917602a10714a4a-test --import-cache type=registry,ref=registry-cache.rshbdev.ru/buildkit-cache/rshbintech/retail/crm-systems/efrfl-ocrm/communication-service:4aa149366163d1c07ba15d054bc31bfa187e4f51 --import-cache type=registry,ref=registry-cache.rshbdev.ru/buildkit-cache/rshbintech/retail/crm-systems/efrfl-ocrm/communication-service:4aa149366163d1c07ba15d054bc31bfa187e4f51-test --export-cache type=registry,oci-mediatypes=false,ref=registry-cache.rshbdev.ru/buildkit-cache/rshbintech/retail/crm-systems/efrfl-ocrm/communication-service:94d4397aac7b64ec7acf5ecc4917602a10714a4a,mode=max --export-cache type=registry,oci-mediatypes=false,ref=registry-cache.rshbdev.ru/buildkit-cache/rshbintech/retail/crm-systems/efrfl-ocrm/communication-service:94d4397aac7b64ec7acf5ecc4917602a10714a4a-test,mode=min --opt build-arg:HTTP_PROXY=http://10.7.200.8:3129 --opt build-arg:http_proxy=http://10.7.200.8:3129 --opt build-arg:HTTPS_PROXY=http://10.7.200.8:3129 --opt build-arg:https_proxy=http://10.7.200.8:3129 --opt build-arg:NO_PROXY=localhost,rshb,gitlab-webservice.gitlab,.rshbdev.ru,.rshbintech.ru,.rshb.pro,.go.rshbank.ru,docker,.0,.1,.2,.3,.4,.5,.6,.7,.8,.9,10,11,12,13,14,15,16,17,18,19,20,21,22,23,24,25,26,27,28,29,30,31,32,33,34,35,36,37,38,39,40,41,42,43,44,45,46,47,48,49,50,51,52,53,54,55,56,57,58,59,60,61,62,63,64,65,66,67,68,69,70,71,72,73,74,75,76,77,78,79,80,81,82,83,84,85,86,87,88,89,90,91,92,93,94,95,96,97,98,99,10.7.27.0/24,10.27.180.0/24 --opt build-arg:no_proxy=localhost,rshb,gitlab-webservice.gitlab,.rshbdev.ru,.rshbintech.ru,.rshb.pro,.go.rshbank.ru,docker,.0,.1,.2,.3,.4,.5,.6,.7,.8,.9,10,11,12,13,14,15,16,17,18,19,20,21,22,23,24,25,26,27,28,29,30,31,32,33,34,35,36,37,38,39,40,41,42,43,44,45,46,47,48,49,50,51,52,53,54,55,56,57,58,59,60,61,62,63,64,65,66,67,68,69,70,71,72,73,74,75,76,77,78,79,80,81,82,83,84,85,86,87,88,89,90,91,92,93,94,95,96,97,98,99,10.7.27.0/24,10.27.180.0/24 --opt build-arg:CI_REGISTRY=registry.rshbdev.ru --opt build-arg:PROXY_REGISTRY=registry-proxy.rshbdev.ru --opt build-arg:IMAGE_NAME__MAVEN=registry.rshbdev.ru/appfarm/infra/images/base/java/build/maven --opt build-arg:IMAGE_TAG__MAVEN=3.9.12-eclipse-temurin-21-rshb.0.2.1 --opt build-arg:IMAGE_NAME__MAVEN_LEGACY=registry.rshbdev.ru/appfarm/infra/images/base/java/build/maven-legacy --opt build-arg:IMAGE_TAG__MAVEN_LEGACY=3.9.12-eclipse-temurin-17-rshb.0.2.0 --opt build-arg:IMAGE_NAME__MAVEN_LATEST=registry.rshbdev.ru/appfarm/infra/images/base/java/build/maven-latest --opt build-arg:IMAGE_TAG__MAVEN_LATEST=3.9.12-eclipse-temurin-25-rshb.0.3.0 --opt build-arg:IMAGE_NAME__MAVEN_CUSTOM= --opt build-arg:IMAGE_TAG__MAVEN_CUSTOM= --opt build-arg:IMAGE_NAME__JRE=registry.rshbdev.ru/appfarm/infra/images/base/java/runtime/jre --opt build-arg:IMAGE_TAG__JRE=21.0.9_10-jre-jammy-rshb.1.0.0 --opt build-arg:IMAGE_NAME__JRE_LEGACY=registry.rshbdev.ru/appfarm/infra/images/base/java/runtime/jre-legacy --opt build-arg:IMAGE_TAG__JRE_LEGACY=17.0.17_10-jre-jammy-rshb.1.1.0 --opt build-arg:IMAGE_NAME__JRE_LATEST=registry.rshbdev.ru/appfarm/infra/images/base/java/runtime/jre-latest --opt build-arg:IMAGE_TAG__JRE_LATEST=25.0.1_8-jre-noble-rshb.1.1.0 --opt build-arg:IMAGE_NAME__TOMCAT=registry.rshbdev.ru/appfarm/infra/images/base/java/runtime/tomcat --opt build-arg:IMAGE_TAG__TOMCAT=10.1.50-jre21-temurin-jammy-rshb.2.0.0 --opt build-arg:IMAGE_NAME__TOMCAT_LEGACY=registry.rshbdev.ru/appfarm/infra/images/base/java/runtime/tomcat-legacy --opt build-arg:IMAGE_TAG__TOMCAT_LEGACY=9.0.113-jre8-temurin-noble-rshb.2.0.0 --opt build-arg:IMAGE_NAME__TOMCAT_LATEST=registry.rshbdev.ru/appfarm/infra/images/base/java/runtime/tomcat-latest --opt build-arg:IMAGE_TAG__TOMCAT_LATEST=11.0.15-jre25-temurin-noble-rshb.2.0.0 --opt build-arg:IMAGE_NAME__TOMEE=registry.rshbdev.ru/appfarm/infra/images/base/java/runtime/tomee --opt build-arg:IMAGE_TAG__TOMEE=9.1.3-jre17-Temurin-plus-rshb.1.0.0 --opt build-arg:IMAGE_NAME__TOMEE_LEGACY=registry.rshbdev.ru/appfarm/infra/images/base/java/runtime/tomee-legacy --opt build-arg:IMAGE_TAG__TOMEE_LEGACY=8.0.16-jre8-Temurin-plus-rshb.1.0.0 --opt build-arg:IMAGE_NAME__TOMEE_LATEST=registry.rshbdev.ru/appfarm/infra/images/base/java/runtime/tomee-latest --opt build-arg:IMAGE_TAG__TOMEE_LATEST=10.1.3-jre25-Temurin-plus-rshb.1.0.0 --opt build-arg:IMAGE_NAME__CRYPTOPRO_MAVEN=registry.rshbdev.ru/appfarm/infra/images/base/java/build/cryptopro-maven --opt build-arg:IMAGE_TAG__CRYPTOPRO_MAVEN=3.9.12-eclipse-temurin-11-rshb.2.0.0 --opt build-arg:IMAGE_NAME__CRYPTOPRO_MAVEN_LEGACY=registry.rshbdev.ru/appfarm/infra/images/base/java/build/cryptopro-maven-legacy --opt build-arg:IMAGE_TAG__CRYPTOPRO_MAVEN_LEGACY=3.9.12-eclipse-temurin-8-rshb.2.0.0 --opt build-arg:IMAGE_NAME__CRYPTOPRO_MAVEN_LATEST=registry.rshbdev.ru/appfarm/infra/images/base/java/build/cryptopro-maven-latest --opt build-arg:IMAGE_TAG__CRYPTOPRO_MAVEN_LATEST=3.9.12-eclipse-temurin-17-rshb.2.0.0 --opt build-arg:IMAGE_NAME__CRYPTOPRO_JRE=registry.rshbdev.ru/appfarm/infra/images/base/java/runtime/cryptopro --opt build-arg:IMAGE_TAG__CRYPTOPRO_JRE=11.0.31_11-jre-jammy-csp-5.0.13700-7-java-csp-5.0.49196-A-rshb.2.0.0 --opt build-arg:IMAGE_NAME__CRYPTOPRO_JRE_LEGACY=registry.rshbdev.ru/appfarm/infra/images/base/java/runtime/cryptopro-legacy --opt build-arg:IMAGE_TAG__CRYPTOPRO_JRE_LEGACY=8u482-b08-jre-jammy-csp-5.0.13700-7-java-csp-5.0.49195-rshb.2.0.0 --opt build-arg:IMAGE_NAME__CRYPTOPRO_JRE_LATEST=registry.rshbdev.ru/appfarm/infra/images/base/java/runtime/cryptopro-latest --opt build-arg:IMAGE_TAG__CRYPTOPRO_JRE_LATEST=17.0.18_8-jre-jammy-csp-5.0.13700-7-java-csp-5.0.49196-A-rshb.2.0.0 --opt build-arg:ARTIFACT_VERSION=feature-eco-dcc-738-fix-SNAPSHOT --opt build-arg:NEXUS_MAVEN_PUBLIC_ID=maven-public --opt build-arg:NEXUS_MAVEN_PUBLIC=https://nexus.rshbdev.ru/repository/maven-public/ --opt build-arg:NEXUS_MAVEN_CUSTOM_ID=maven-custom --opt build-arg:NEXUS_MAVEN_CUSTOM=https://nexus.rshbdev.ru/repository/maven-custom/ --opt build-arg:NEXUS_MAVEN_RELEASES_ID=maven-releases --opt build-arg:NEXUS_MAVEN_RELEASES=https://nexus.rshbdev.ru/repository/maven-releases/ --opt build-arg:NEXUS_MAVEN_SNAPSHOTS_ID=maven-snapshots --opt build-arg:NEXUS_MAVEN_SNAPSHOTS=https://nexus.rshbdev.ru/repository/maven-snapshots/ --opt build-arg:NEXUS_MAVEN_PUBLIC_USERNAME=cicd-ro --opt build-arg:NEXUS_MAVEN_PUBLIC_PASSWORD=[MASKED] --opt build-arg:NEXUS_MAVEN_RELEASES_USERNAME=cicd-rw --opt build-arg:NEXUS_MAVEN_RELEASES_PASSWORD=[MASKED] --opt build-arg:NEXUS_MAVEN_SNAPSHOTS_USERNAME=cicd-rw --opt build-arg:NEXUS_MAVEN_SNAPSHOTS_PASSWORD=[MASKED] --opt build-arg:NEXUS_MAVEN_CUSTOM_USERNAME=cicd-rw --opt build-arg:NEXUS_MAVEN_CUSTOM_PASSWORD=[MASKED] --opt build-arg:MAVEN_EXTRA_OPTS= --opt build-arg:MAVEN_CLI_EXTRA_OPTS= --opt build-arg:MAVEN_MULTIMODULE_POMS= --opt build-arg:E2E_TRIGGER_TEST_CMDLINE= --opt build-arg:E2E_TEST_CMDLINE= --opt build-arg:E2E_TRIGGER_TEST_ARGS= --opt build-arg:WAR_SERVER_TYPE= --opt build-arg:CI_PIPELINE_CREATED_AT=2026-09-07T21:08:42+03:00
> [INFO] Заданы пути к артефактам для извлечения из образа после сборки: app/**/target/surefire-reports, app/**/target/failsafe-reports, app/target/surefire-reports, app/target/failsafe-reports, e2e_exit_code
#1 [internal] load build definition from Dockerfile
#1 transferring dockerfile: 1.60kB done
#1 DONE 0.0s
#2 [internal] load metadata for registry.rshbdev.ru/appfarm/infra/images/base/java/build/maven:3.9.12-eclipse-temurin-21-rshb.0.2.1
#2 DONE 0.3s
#3 [internal] load .dockerignore
#3 transferring context: 1.25kB done
#3 DONE 0.0s
#4 [internal] load build context
#4 DONE 0.0s
#5 [build 1/8] FROM registry.rshbdev.ru/appfarm/infra/images/base/java/build/maven:3.9.12-eclipse-temurin-21-rshb.0.2.1@sha256:6f20f0f4b02a646e6f5bdd9262825483f674f75eaffd14a20ec74fd6ede9b4af
#5 resolve registry.rshbdev.ru/appfarm/infra/images/base/java/build/maven:3.9.12-eclipse-temurin-21-rshb.0.2.1@sha256:6f20f0f4b02a646e6f5bdd9262825483f674f75eaffd14a20ec74fd6ede9b4af 0.0s done
#5 DONE 0.0s
#6 importing cache manifest from registry-cache.rshbdev.ru/buildkit-cache/rshbintech/retail/crm-systems/efrfl-ocrm/communication-service:4aa149366163d1c07ba15d054bc31bfa187e4f51-test
#6 inferred cache manifest type: application/vnd.docker.distribution.manifest.list.v2+json done
#6 DONE 0.3s
#7 importing cache manifest from registry-cache.rshbdev.ru/buildkit-cache/rshbintech/retail/crm-systems/efrfl-ocrm/communication-service:94d4397aac7b64ec7acf5ecc4917602a10714a4a-test
#7 ERROR: failed to configure registry cache importer: registry-cache.rshbdev.ru/buildkit-cache/rshbintech/retail/crm-systems/efrfl-ocrm/communication-service:94d4397aac7b64ec7acf5ecc4917602a10714a4a-test: not found
#8 importing cache manifest from registry-cache.rshbdev.ru/buildkit-cache/rshbintech/retail/crm-systems/efrfl-ocrm/communication-service:4aa149366163d1c07ba15d054bc31bfa187e4f51
#8 inferred cache manifest type: application/vnd.docker.distribution.manifest.list.v2+json done
#8 DONE 0.3s
#9 importing cache manifest from registry-cache.rshbdev.ru/buildkit-cache/rshbintech/retail/crm-systems/efrfl-ocrm/communication-service:94d4397aac7b64ec7acf5ecc4917602a10714a4a
#9 inferred cache manifest type: application/vnd.docker.distribution.manifest.list.v2+json done
#9 DONE 0.3s
#4 [internal] load build context
#4 transferring context: 8.48MB 0.2s done
#4 DONE 0.2s
#10 [build 5/8] COPY --chown=app:app ocrm-communication-service-app/ ocrm-communication-service-app/
#10 CACHED
#11 [build 6/8] RUN mvn versions:set-property -Dproperty=artifactVersion -DnewVersion=feature-eco-dcc-738-fix-SNAPSHOT
#11 CACHED
#12 [build 7/8] RUN mvn versions:set-property -Dproperty=revision -DnewVersion=feature-eco-dcc-738-fix-SNAPSHOT
#12 CACHED
#13 [build 2/8] RUN useradd -d /app -m -u 1001 app && mkdir /app/.m2 && cp /root/.m2/settings.xml /app/.m2/settings.xml && chown -R app:app /app
#13 CACHED
#14 [build 3/8] WORKDIR /app
#14 CACHED
#15 [build 4/8] COPY --chown=app:app pom.xml .
#15 CACHED
#16 [build 8/8] RUN mvn --batch-mode --errors --show-version -T 8C clean compile -DskipTests
#16 sha256:c41c49acf99a8b4be876f918a27d01e388dc34243ab3d036d06800055118d261 2.61kB / 2.61kB 0.0s done
#16 sha256:fff56b2d11102b9383d185f03e94ae2110bd1eb7aa75e90e2479a4cb37b74730 11.53MB / 165.68MB 0.2s
#16 sha256:f4542ea084f8e99fc5d6c7fd9ddf41709d865cc72c7b5cf6b4ef8b7f848005b0 2.59kB / 2.59kB 0.1s done
#16 sha256:9bdbc7f5c227e2e66e10a31b6d3e2abfa8283a549e5e1dd61cd9db3fb42f8c24 4.19MB / 32.06MB 0.2s
#16 sha256:7a8253a855abbf7d1b90d59a1dd23d219752f7e12c518458d1de2553496689ff 3.47MB / 3.47MB 0.2s done
#16 sha256:fff56b2d11102b9383d185f03e94ae2110bd1eb7aa75e90e2479a4cb37b74730 22.02MB / 165.68MB 0.3s
#16 sha256:9bdbc7f5c227e2e66e10a31b6d3e2abfa8283a549e5e1dd61cd9db3fb42f8c24 11.53MB / 32.06MB 0.3s
#16 sha256:4f4fb700ef54461cfa02571ae0db9a0dc1e0cdb5577484a6d75e68dc38e8acc1 32B / 32B 0.1s done
#16 sha256:c3b0ef768476c9aa8ac45c0a770abb8fc84d85182262b2d2bf0e36cb58520a94 300B / 300B 0.1s done
#16 sha256:fff56b2d11102b9383d185f03e94ae2110bd1eb7aa75e90e2479a4cb37b74730 33.55MB / 165.68MB 0.5s
#16 sha256:9bdbc7f5c227e2e66e10a31b6d3e2abfa8283a549e5e1dd61cd9db3fb42f8c24 22.02MB / 32.06MB 0.5s
#16 sha256:accd15057c52e92f685be1ce59735a92594298c0fa7e36e99d8c2360984de415 2.19kB / 2.19kB 0.1s done
#16 sha256:8cb5593b659ca429dc8f33adfda6c5a491172da3292236c40306fc8f4e235268 984B / 984B 0.1s done
#16 sha256:fff56b2d11102b9383d185f03e94ae2110bd1eb7aa75e90e2479a4cb37b74730 41.94MB / 165.68MB 0.6s
#16 sha256:94f0af2bd956fa44e1ed9f42f9afd9bf724281abaede4e11f8fe624c535bd53f 4.19MB / 38.74MB 0.2s
#16 sha256:ae1374c2da5566e6bdaf72cf3740f98da8d6629ad47c0784d46de1e7dfea9dee 12.62kB / 12.62kB 0.1s done
#16 sha256:9bdbc7f5c227e2e66e10a31b6d3e2abfa8283a549e5e1dd61cd9db3fb42f8c24 32.06MB / 32.06MB 0.6s done
#16 sha256:94f0af2bd956fa44e1ed9f42f9afd9bf724281abaede4e11f8fe624c535bd53f 15.73MB / 38.74MB 0.3s
#16 sha256:e4956b47023ad51643ca562619618e708688d1015cb3e7cf77b72ae78edeb731 93B / 93B 0.1s done
#16 sha256:d7ab273d6fb9f7364acbe39a9a4c255d5cee98c04b742971efd005dc57632734 156B / 156B 0.1s done
#16 sha256:fff56b2d11102b9383d185f03e94ae2110bd1eb7aa75e90e2479a4cb37b74730 54.53MB / 165.68MB 0.8s
#16 sha256:94f0af2bd956fa44e1ed9f42f9afd9bf724281abaede4e11f8fe624c535bd53f 28.31MB / 38.74MB 0.5s
#16 sha256:e2ee788762ebb525fd1416be55d22c588dcd94e21e1d62ff50addff1f40aadf5 848B / 848B 0.1s done
#16 sha256:fff56b2d11102b9383d185f03e94ae2110bd1eb7aa75e90e2479a4cb37b74730 63.96MB / 165.68MB 0.9s
#16 sha256:94f0af2bd956fa44e1ed9f42f9afd9bf724281abaede4e11f8fe624c535bd53f 38.74MB / 38.74MB 0.7s done
#16 sha256:f0c7ffc223a983964f2db2dd53152036d70871f230c7787e84a6bc0c90d37ca0 4.19MB / 9.31MB 0.2s
#16 sha256:fb3ce10e989d0cd06874b65b1dda658724422a842aaada1168763ca7ce1698d9 4.19MB / 22.54MB 0.2s
#16 sha256:fff56b2d11102b9383d185f03e94ae2110bd1eb7aa75e90e2479a4cb37b74730 72.35MB / 165.68MB 1.1s
#16 sha256:f0c7ffc223a983964f2db2dd53152036d70871f230c7787e84a6bc0c90d37ca0 9.31MB / 9.31MB 0.3s done
#16 sha256:fb3ce10e989d0cd06874b65b1dda658724422a842aaada1168763ca7ce1698d9 12.58MB / 22.54MB 0.3s
#16 sha256:fb3ce10e989d0cd06874b65b1dda658724422a842aaada1168763ca7ce1698d9 16.78MB / 22.54MB 0.5s
#16 sha256:c45a8f54c8db9e11d290f2107825fe437f540a499ffbd9b6f1cacdc720e6513c 0B / 2.28kB 0.2s
#16 sha256:e6b56ff66d06b2f934e91725f7c5fb8077614763b978608b6ec116137cb910a1 0B / 158B 0.2s
#16 sha256:fff56b2d11102b9383d185f03e94ae2110bd1eb7aa75e90e2479a4cb37b74730 81.79MB / 165.68MB 1.4s
#16 sha256:fb3ce10e989d0cd06874b65b1dda658724422a842aaada1168763ca7ce1698d9 20.97MB / 22.54MB 0.6s
#16 sha256:fb3ce10e989d0cd06874b65b1dda658724422a842aaada1168763ca7ce1698d9 22.54MB / 22.54MB 0.8s done
#16 sha256:c45a8f54c8db9e11d290f2107825fe437f540a499ffbd9b6f1cacdc720e6513c 2.28kB / 2.28kB 0.5s done
#16 sha256:e6b56ff66d06b2f934e91725f7c5fb8077614763b978608b6ec116137cb910a1 158B / 158B 0.5s done
#16 sha256:fff56b2d11102b9383d185f03e94ae2110bd1eb7aa75e90e2479a4cb37b74730 98.57MB / 165.68MB 1.7s
#16 sha256:f12c2f6b47b7df253d03d4086c043b302e87c4d2b15e486ecf2ffb4cc12ada74 0B / 157.87MB 0.2s
#16 sha256:868b909f8ce74fe7ddc783497c20e0a48df48b9f555fc57049945f9c47039c95 0B / 22.96MB 0.2s
#16 sha256:01d7766a2e4a62b74e0bebf2cd12c47e675e9221174f6570854203e84ffe68b0 0B / 29.73MB 0.2s
#16 sha256:868b909f8ce74fe7ddc783497c20e0a48df48b9f555fc57049945f9c47039c95 3.15MB / 22.96MB 0.3s
#16 sha256:fff56b2d11102b9383d185f03e94ae2110bd1eb7aa75e90e2479a4cb37b74730 110.10MB / 165.68MB 2.0s
#16 sha256:f12c2f6b47b7df253d03d4086c043b302e87c4d2b15e486ecf2ffb4cc12ada74 15.19MB / 157.87MB 0.5s
#16 sha256:868b909f8ce74fe7ddc783497c20e0a48df48b9f555fc57049945f9c47039c95 7.34MB / 22.96MB 0.5s
#16 sha256:01d7766a2e4a62b74e0bebf2cd12c47e675e9221174f6570854203e84ffe68b0 4.19MB / 29.73MB 0.5s
#16 sha256:868b909f8ce74fe7ddc783497c20e0a48df48b9f555fc57049945f9c47039c95 11.53MB / 22.96MB 0.6s
#16 sha256:01d7766a2e4a62b74e0bebf2cd12c47e675e9221174f6570854203e84ffe68b0 8.39MB / 29.73MB 0.6s
#16 sha256:fff56b2d11102b9383d185f03e94ae2110bd1eb7aa75e90e2479a4cb37b74730 121.63MB / 165.68MB 2.3s
#16 sha256:f12c2f6b47b7df253d03d4086c043b302e87c4d2b15e486ecf2ffb4cc12ada74 24.12MB / 157.87MB 0.8s
#16 sha256:868b909f8ce74fe7ddc783497c20e0a48df48b9f555fc57049945f9c47039c95 18.87MB / 22.96MB 0.8s
#16 sha256:01d7766a2e4a62b74e0bebf2cd12c47e675e9221174f6570854203e84ffe68b0 15.73MB / 29.73MB 0.8s
#16 sha256:f12c2f6b47b7df253d03d4086c043b302e87c4d2b15e486ecf2ffb4cc12ada74 32.51MB / 157.87MB 1.1s
#16 sha256:868b909f8ce74fe7ddc783497c20e0a48df48b9f555fc57049945f9c47039c95 22.96MB / 22.96MB 1.0s done
#16 sha256:01d7766a2e4a62b74e0bebf2cd12c47e675e9221174f6570854203e84ffe68b0 24.12MB / 29.73MB 1.1s
#16 sha256:fff56b2d11102b9383d185f03e94ae2110bd1eb7aa75e90e2479a4cb37b74730 138.41MB / 165.68MB 2.7s
#16 sha256:f12c2f6b47b7df253d03d4086c043b302e87c4d2b15e486ecf2ffb4cc12ada74 40.89MB / 157.87MB 1.2s
#16 sha256:01d7766a2e4a62b74e0bebf2cd12c47e675e9221174f6570854203e84ffe68b0 29.73MB / 29.73MB 1.1s done
#16 extracting sha256:01d7766a2e4a62b74e0bebf2cd12c47e675e9221174f6570854203e84ffe68b0
#16 sha256:fff56b2d11102b9383d185f03e94ae2110bd1eb7aa75e90e2479a4cb37b74730 150.99MB / 165.68MB 3.0s
#16 sha256:f12c2f6b47b7df253d03d4086c043b302e87c4d2b15e486ecf2ffb4cc12ada74 52.43MB / 157.87MB 1.5s
#16 sha256:fff56b2d11102b9383d185f03e94ae2110bd1eb7aa75e90e2479a4cb37b74730 159.38MB / 165.68MB 3.3s
#16 sha256:f12c2f6b47b7df253d03d4086c043b302e87c4d2b15e486ecf2ffb4cc12ada74 60.82MB / 157.87MB 2.0s
#16 sha256:fff56b2d11102b9383d185f03e94ae2110bd1eb7aa75e90e2479a4cb37b74730 165.68MB / 165.68MB 3.7s done
#16 sha256:f12c2f6b47b7df253d03d4086c043b302e87c4d2b15e486ecf2ffb4cc12ada74 83.89MB / 157.87MB 2.1s
#16 sha256:f12c2f6b47b7df253d03d4086c043b302e87c4d2b15e486ecf2ffb4cc12ada74 111.15MB / 157.87MB 2.3s
#16 extracting sha256:01d7766a2e4a62b74e0bebf2cd12c47e675e9221174f6570854203e84ffe68b0 1.0s done
#16 extracting sha256:868b909f8ce74fe7ddc783497c20e0a48df48b9f555fc57049945f9c47039c95
#16 sha256:f12c2f6b47b7df253d03d4086c043b302e87c4d2b15e486ecf2ffb4cc12ada74 138.41MB / 157.87MB 2.4s
#16 sha256:f12c2f6b47b7df253d03d4086c043b302e87c4d2b15e486ecf2ffb4cc12ada74 157.87MB / 157.87MB 2.6s done
#16 extracting sha256:868b909f8ce74fe7ddc783497c20e0a48df48b9f555fc57049945f9c47039c95 1.0s done
#16 extracting sha256:f12c2f6b47b7df253d03d4086c043b302e87c4d2b15e486ecf2ffb4cc12ada74
#16 extracting sha256:f12c2f6b47b7df253d03d4086c043b302e87c4d2b15e486ecf2ffb4cc12ada74 2.2s done
#16 extracting sha256:e6b56ff66d06b2f934e91725f7c5fb8077614763b978608b6ec116137cb910a1 0.0s done
#16 extracting sha256:c45a8f54c8db9e11d290f2107825fe437f540a499ffbd9b6f1cacdc720e6513c 0.0s done
#16 extracting sha256:fb3ce10e989d0cd06874b65b1dda658724422a842aaada1168763ca7ce1698d9
#16 extracting sha256:fb3ce10e989d0cd06874b65b1dda658724422a842aaada1168763ca7ce1698d9 1.1s done
#16 extracting sha256:f0c7ffc223a983964f2db2dd53152036d70871f230c7787e84a6bc0c90d37ca0
#16 extracting sha256:f0c7ffc223a983964f2db2dd53152036d70871f230c7787e84a6bc0c90d37ca0 0.1s done
#16 extracting sha256:e2ee788762ebb525fd1416be55d22c588dcd94e21e1d62ff50addff1f40aadf5 0.0s done
#16 extracting sha256:4f4fb700ef54461cfa02571ae0db9a0dc1e0cdb5577484a6d75e68dc38e8acc1 0.0s done
#16 extracting sha256:d7ab273d6fb9f7364acbe39a9a4c255d5cee98c04b742971efd005dc57632734 0.0s done
#16 DONE 9.0s
#16 [build 8/8] RUN mvn --batch-mode --errors --show-version -T 8C clean compile -DskipTests
#16 extracting sha256:e4956b47023ad51643ca562619618e708688d1015cb3e7cf77b72ae78edeb731 0.0s done
#16 extracting sha256:ae1374c2da5566e6bdaf72cf3740f98da8d6629ad47c0784d46de1e7dfea9dee 0.0s done
#16 extracting sha256:94f0af2bd956fa44e1ed9f42f9afd9bf724281abaede4e11f8fe624c535bd53f
#16 extracting sha256:94f0af2bd956fa44e1ed9f42f9afd9bf724281abaede4e11f8fe624c535bd53f 0.6s done
#16 extracting sha256:8cb5593b659ca429dc8f33adfda6c5a491172da3292236c40306fc8f4e235268 0.0s done
#16 extracting sha256:c3b0ef768476c9aa8ac45c0a770abb8fc84d85182262b2d2bf0e36cb58520a94 0.0s done
#16 DONE 9.7s
#16 [build 8/8] RUN mvn --batch-mode --errors --show-version -T 8C clean compile -DskipTests
#16 extracting sha256:4f4fb700ef54461cfa02571ae0db9a0dc1e0cdb5577484a6d75e68dc38e8acc1 0.0s done
#16 extracting sha256:accd15057c52e92f685be1ce59735a92594298c0fa7e36e99d8c2360984de415 0.0s done
#16 extracting sha256:f4542ea084f8e99fc5d6c7fd9ddf41709d865cc72c7b5cf6b4ef8b7f848005b0 0.0s done
#16 extracting sha256:7a8253a855abbf7d1b90d59a1dd23d219752f7e12c518458d1de2553496689ff
#16 extracting sha256:7a8253a855abbf7d1b90d59a1dd23d219752f7e12c518458d1de2553496689ff 0.4s done
#16 DONE 10.1s
#16 [build 8/8] RUN mvn --batch-mode --errors --show-version -T 8C clean compile -DskipTests
#16 extracting sha256:9bdbc7f5c227e2e66e10a31b6d3e2abfa8283a549e5e1dd61cd9db3fb42f8c24
#16 extracting sha256:9bdbc7f5c227e2e66e10a31b6d3e2abfa8283a549e5e1dd61cd9db3fb42f8c24 0.7s done
#16 extracting sha256:c41c49acf99a8b4be876f918a27d01e388dc34243ab3d036d06800055118d261
#16 extracting sha256:c41c49acf99a8b4be876f918a27d01e388dc34243ab3d036d06800055118d261 0.0s done
#16 extracting sha256:fff56b2d11102b9383d185f03e94ae2110bd1eb7aa75e90e2479a4cb37b74730
#16 extracting sha256:fff56b2d11102b9383d185f03e94ae2110bd1eb7aa75e90e2479a4cb37b74730 2.5s done
#16 DONE 13.4s
#17 [test 1/2] RUN mvn --batch-mode --errors --show-version -T 8C test
#17 0.445 Apache Maven 3.9.12 (848fbb4bf2d427b72bdb2471c22fced7ebd9a7a1)
#17 0.445 Maven home: /usr/share/maven
#17 0.445 Java version: 21.0.10, vendor: Eclipse Adoptium, runtime: /opt/java/openjdk
#17 0.445 Default locale: en_US, platform encoding: UTF-8
#17 0.445 OS name: "linux", version: "6.1.90-un-def-alt1", arch: "amd64", family: "unix"
#17 1.854 06:15:11 [INFO] Error stacktraces are turned on.
#17 1.877 06:15:11 [WARNING]
#17 1.877 06:15:11 [WARNING] Some problems were encountered while building the effective settings
#17 1.879 06:15:11 [WARNING] 'profiles.profile[default].repositories.repository.id' must not contain any of these characters \/:"<>|?* but found : @ /app/.m2/settings.xml
#17 1.879 06:15:11 [WARNING] 'profiles.profile[default].repositories.repository.id' must not contain any of these characters \/:"<>|?* but found : @ /app/.m2/settings.xml
#17 1.879 06:15:11 [WARNING]
#17 1.927 06:15:11 [INFO] Scanning for projects...
#17 3.500 06:15:13 [WARNING]
#17 3.500 06:15:13 [WARNING] Some problems were encountered while building the effective model for ru.rshbintech.retail.crm-systems.efrfl-ocrm:ocrm-communication-service-app:jar:feature-eco-dcc-738-fix-SNAPSHOT
#17 3.500 06:15:13 [WARNING] 'build.plugins.plugin.version' for org.codehaus.mojo:exec-maven-plugin is missing. @ ru.rshbintech.retail.crm-systems.efrfl-ocrm:ocrm-communication-service-app:${revision}, /app/ocrm-communication-service-app/pom.xml, line 534, column 21
#17 3.500 06:15:13 [WARNING] The expression ${parent.artifactId} is deprecated. Please use ${project.parent.artifactId} instead.
#17 3.500 06:15:13 [WARNING] 'repositories.repository.id' must not contain any of these characters \/:"<>|?* but found :
#17 3.500 06:15:13 [WARNING] 'repositories.repository.id' must not contain any of these characters \/:"<>|?* but found :
#17 3.500 06:15:13 [WARNING]
#17 3.500 06:15:13 [WARNING] Some problems were encountered while building the effective model for ru.rshbintech.retail.crm-systems.efrfl-ocrm:communication-service:pom:feature-eco-dcc-738-fix-SNAPSHOT
#17 3.500 06:15:13 [WARNING] 'repositories.repository.id' must not contain any of these characters \/:"<>|?* but found :
#17 3.501 06:15:13 [WARNING] 'repositories.repository.id' must not contain any of these characters \/:"<>|?* but found :
#17 3.501 06:15:13 [WARNING]
#17 3.501 06:15:13 [WARNING] It is highly recommended to fix these problems because they threaten the stability of your build.
#17 3.501 06:15:13 [WARNING]
#17 3.501 06:15:13 [WARNING] For this reason, future Maven versions might no longer support building such malformed projects.
#17 3.501 06:15:13 [WARNING]
#17 3.515 06:15:13 [INFO] ------------------------------------------------------------------------
#17 3.515 06:15:13 [INFO] Reactor Build Order:
#17 3.515 06:15:13 [INFO]
#17 3.515 06:15:13 [INFO] ocrm-communication-service [pom]
#17 3.515 06:15:13 [INFO] ocrm-communication-service-app [jar]
#17 3.532 06:15:13 [INFO]
#17 3.532 06:15:13 [INFO] Using the MultiThreadedBuilder implementation with a thread count of 128
#17 3.541 06:15:13 [INFO]
#17 3.542 06:15:13 [INFO] --< ru.rshbintech.retail.crm-systems.efrfl-ocrm:communication-service >--
#17 3.542 06:15:13 [INFO] Building ocrm-communication-service feature-eco-dcc-738-fix-SNAPSHOT [1/2]
#17 3.542 06:15:13 [INFO] from pom.xml
#17 3.542 06:15:13 [INFO] --------------------------------[ pom ]---------------------------------
#17 3.936 06:15:13 [INFO]
#17 3.936 06:15:13 [INFO] --- enforcer:1.4.1:enforce (enforce) @ communication-service ---
#17 4.273 06:15:13 [INFO]
#17 4.273 06:15:13 [INFO] --- jacoco:0.8.11:prepare-agent (jacoco-init) @ communication-service ---
#17 4.397 06:15:14 [INFO] argLine set to -javaagent:/app/.m2/repository/org/jacoco/org.jacoco.agent/0.8.11/org.jacoco.agent-0.8.11-runtime.jar=destfile=/app/target/jacoco.exec
#17 4.397 06:15:14 [INFO]
#17 4.397 06:15:14 [INFO] --- jacoco:0.8.11:prepare-agent (pre-unit-test) @ communication-service ---
#17 4.400 06:15:14 [INFO] argLine set to -javaagent:/app/.m2/repository/org/jacoco/org.jacoco.agent/0.8.11/org.jacoco.agent-0.8.11-runtime.jar=destfile=/app/target/jacoco.exec
#17 4.400 06:15:14 [INFO]
#17 4.400 06:15:14 [INFO] --- flatten:1.2.7:flatten (flatten) @ communication-service ---
#17 5.069 06:15:14 [INFO] Generating flattened POM of project ru.rshbintech.retail.crm-systems.efrfl-ocrm:communication-service:pom:feature-eco-dcc-738-fix-SNAPSHOT...
#17 5.246 06:15:14 [INFO]
#17 5.246 06:15:14 [INFO] --- jacoco:0.8.11:report (post-unit-test) @ communication-service ---
#17 5.258 06:15:14 [INFO] Skipping JaCoCo execution due to missing execution data file.
#17 5.261 06:15:14 [INFO]
#17 5.261 06:15:14 [INFO] --< ru.rshbintech.retail.crm-systems.efrfl-ocrm:ocrm-communication-service-app >--
#17 5.261 06:15:14 [INFO] Building ocrm-communication-service-app feature-eco-dcc-738-fix-SNAPSHOT [2/2]
#17 5.261 06:15:14 [INFO] from ocrm-communication-service-app/pom.xml
#17 5.261 06:15:14 [INFO] --------------------------------[ jar ]---------------------------------
#17 25.92 06:15:35 [WARNING] The artifact org.slf4j:slf4j-log4j12:jar:1.7.36 has been relocated to org.slf4j:slf4j-reload4j:jar:1.7.36
#17 46.19 06:15:55 [INFO]
#17 46.19 06:15:55 [INFO] --- enforcer:1.4.1:enforce (enforce) @ ocrm-communication-service-app ---
#17 49.67 06:15:59 [WARNING] While downloading org.slf4j:slf4j-log4j12:1.7.36
#17 49.67 This artifact has been relocated to org.slf4j:slf4j-reload4j:1.7.36.
#17 49.67
#17 49.67
#17 49.68 06:15:59 [INFO]
#17 49.68 06:15:59 [INFO] --- jacoco:0.8.11:prepare-agent (jacoco-init) @ ocrm-communication-service-app ---
#17 49.68 06:15:59 [INFO] argLine set to -javaagent:/app/.m2/repository/org/jacoco/org.jacoco.agent/0.8.11/org.jacoco.agent-0.8.11-runtime.jar=destfile=/app/ocrm-communication-service-app/target/jacoco.exec
#17 49.68 06:15:59 [INFO]
#17 49.68 06:15:59 [INFO] --- jacoco:0.8.11:prepare-agent (pre-unit-test) @ ocrm-communication-service-app ---
#17 49.68 06:15:59 [INFO] argLine set to -javaagent:/app/.m2/repository/org/jacoco/org.jacoco.agent/0.8.11/org.jacoco.agent-0.8.11-runtime.jar=destfile=/app/ocrm-communication-service-app/target/jacoco.exec
#17 49.68 06:15:59 [INFO]
#17 49.68 06:15:59 [INFO] --- spring-boot:2.7.1:build-info (generate-build-info) @ ocrm-communication-service-app ---
#17 50.00 06:15:59 [INFO]
#17 50.00 06:15:59 [INFO] --- resources:3.0.2:resources (default-resources) @ ocrm-communication-service-app ---
#17 50.06 06:15:59 [INFO] Using 'UTF-8' encoding to copy filtered resources.
#17 50.07 06:15:59 [INFO] Copying 43 resources
#17 50.07 06:15:59 [INFO]
#17 50.07 06:15:59 [INFO] --- flatten:1.2.7:flatten (flatten) @ ocrm-communication-service-app ---
#17 50.07 06:15:59 [INFO] Generating flattened POM of project ru.rshbintech.retail.crm-systems.efrfl-ocrm:ocrm-communication-service-app:jar:feature-eco-dcc-738-fix-SNAPSHOT...
#17 50.13 06:15:59 [INFO]
#17 50.13 06:15:59 [INFO] --- compiler:3.6.1:compile (default-compile) @ ocrm-communication-service-app ---
#17 50.41 06:16:00 [INFO] Nothing to compile - all classes are up to date
#17 50.41 06:16:00 [INFO]
#17 50.41 06:16:00 [INFO] --- resources:3.0.2:testResources (default-testResources) @ ocrm-communication-service-app ---
#17 50.42 06:16:00 [INFO] Using 'UTF-8' encoding to copy filtered resources.
#17 50.42 06:16:00 [INFO] Copying 7 resources
#17 50.42 06:16:00 [INFO]
#17 50.42 06:16:00 [INFO] --- compiler:3.6.1:testCompile (default-testCompile) @ ocrm-communication-service-app ---
#17 50.49 06:16:00 [INFO] Changes detected - recompiling the module!
#17 50.49 06:16:00 [INFO] Compiling 164 source files to /app/ocrm-communication-service-app/target/test-classes
#17 65.00 06:16:14 [INFO] /app/ocrm-communication-service-app/src/test/java/ru/rshbintech/retail/frontsystem/efr/biz/ocrm/test/communications/integrations/processes/config/DocumentBpmSupport.java: /app/ocrm-communication-service-app/src/test/java/ru/rshbintech/retail/frontsystem/efr/biz/ocrm/test/communications/integrations/processes/config/DocumentBpmSupport.java uses or overrides a deprecated API.
#17 65.00 06:16:14 [INFO] /app/ocrm-communication-service-app/src/test/java/ru/rshbintech/retail/frontsystem/efr/biz/ocrm/test/communications/integrations/processes/config/DocumentBpmSupport.java: Recompile with -Xlint:deprecation for details.
#17 65.00 06:16:14 [INFO] /app/ocrm-communication-service-app/src/test/java/ru/rshbintech/retail/frontsystem/efr/biz/ocrm/test/communications/integrations/controllers/CardDboBlockingServiceControllerTest.java: Some input files use unchecked or unsafe operations.
#17 65.00 06:16:14 [INFO] /app/ocrm-communication-service-app/src/test/java/ru/rshbintech/retail/frontsystem/efr/biz/ocrm/test/communications/integrations/controllers/CardDboBlockingServiceControllerTest.java: Recompile with -Xlint:unchecked for details.
#17 65.00 06:16:14 [INFO]
#17 65.00 06:16:14 [INFO] --- surefire:2.22.0:test (default-test) @ ocrm-communication-service-app ---
#17 66.61 06:16:16 [INFO] Surefire report directory: /app/ocrm-communication-service-app/target/surefire-reports
#17 67.64 06:16:17 [INFO]
#17 67.64 06:16:17 [INFO] -------------------------------------------------------
#17 67.64 06:16:17 [INFO] T E S T S
#17 67.64 06:16:17 [INFO] -------------------------------------------------------
#17 69.36 06:16:19 [WARNING] Corrupted STDOUT by directly writing to native stream in forked JVM 1. See FAQ web page and the dump file /app/ocrm-communication-service-app/target/surefire-reports/2026-09-08T06-16-16_280-jvmRun1.dumpstream
#17 70.03 06:16:19 [INFO] Running ru.rshbintech.retail.frontsystem.efr.biz.ocrm.test.communications.integrations.controllers.ClientRegisterControllerTest
#17 71.02
#17 71.02 . ____ _ __ _ _
#17 71.02 /\\ / ___'_ __ _ _(_)_ __ __ _ \ \ \ \
#17 71.02 ( ( )\___ | '_ | '_| | '_ \/ _` | \ \ \ \
#17 71.02 \\/ ___)| |_)| | | | | || (_| | ) ) ) )
#17 71.02 ' |____| .__|_| |_|_| |_\__, | / / / /
#17 71.02 =========|_|==============|___/=/_/_/_/
#17 71.03 :: Spring Boot :: (v2.7.1)
#17 71.03
#17 82.27 Sep 08, 2026 6:16:31 AM org.apache.catalina.core.StandardService startInternal
#17 82.27 INFO: Starting service [Tomcat]
#17 82.27 Sep 08, 2026 6:16:31 AM org.apache.catalina.core.StandardEngine startInternal
#17 82.27 INFO: Starting Servlet engine: [Apache Tomcat/9.0.64]
#17 82.45 Sep 08, 2026 6:16:32 AM org.apache.catalina.core.ApplicationContext log
#17 82.45 INFO: Initializing Spring embedded WebApplicationContext
#17 101.1 Sep 08, 2026 9:16:50 AM org.apache.catalina.core.ApplicationContext log
#17 101.1 INFO: Initializing Spring DispatcherServlet 'dispatcherServlet'
#17 102.2 06:16:51 [INFO] Tests run: 1, Failures: 0, Errors: 0, Skipped: 0, Time elapsed: 32.105 s - in ru.rshbintech.retail.frontsystem.efr.biz.ocrm.test.communications.integrations.controllers.ClientRegisterControllerTest
#17 102.2 06:16:51 [INFO] Running ru.rshbintech.retail.frontsystem.efr.biz.ocrm.test.communications.integrations.controllers.ClientControllerTest
#17 103.7 06:16:53 [WARNING] Tests run: 16, Failures: 0, Errors: 0, Skipped: 2, Time elapsed: 1.514 s - in ru.rshbintech.retail.frontsystem.efr.biz.ocrm.test.communications.integrations.controllers.ClientControllerTest
#17 103.7 06:16:53 [INFO] Running ru.rshbintech.retail.frontsystem.efr.biz.ocrm.test.communications.integrations.controllers.CreateClientAppealControllerTest
#17 103.8 06:16:53 [INFO] Tests run: 3, Failures: 0, Errors: 0, Skipped: 0, Time elapsed: 0.073 s - in ru.rshbintech.retail.frontsystem.efr.biz.ocrm.test.communications.integrations.controllers.CreateClientAppealControllerTest
#17 103.8 06:16:53 [INFO] Running ru.rshbintech.retail.frontsystem.efr.biz.ocrm.test.communications.integrations.controllers.EmailOperationControllerTest
#17 103.9 06:16:53 [INFO] Tests run: 2, Failures: 0, Errors: 0, Skipped: 0, Time elapsed: 0.072 s - in ru.rshbintech.retail.frontsystem.efr.biz.ocrm.test.communications.integrations.controllers.EmailOperationControllerTest
#17 103.9 06:16:53 [INFO] Running ru.rshbintech.retail.frontsystem.efr.biz.ocrm.test.communications.integrations.controllers.CommunicationExternalParamsControllerTest
#17 104.9 06:16:54 [INFO] Tests run: 16, Failures: 0, Errors: 0, Skipped: 0, Time elapsed: 1.024 s - in ru.rshbintech.retail.frontsystem.efr.biz.ocrm.test.communications.integrations.controllers.CommunicationExternalParamsControllerTest
#17 104.9 06:16:54 [INFO] Running ru.rshbintech.retail.frontsystem.efr.biz.ocrm.test.communications.integrations.controllers.ClientConsentControllerTest
#17 105.7 06:16:55 [INFO] Tests run: 11, Failures: 0, Errors: 0, Skipped: 0, Time elapsed: 0.757 s - in ru.rshbintech.retail.frontsystem.efr.biz.ocrm.test.communications.integrations.controllers.ClientConsentControllerTest
#17 105.7 06:16:55 [INFO] Running ru.rshbintech.retail.frontsystem.efr.biz.ocrm.test.communications.integrations.controllers.CommunicationCallbackControllerTest
#17 106.0 06:16:55 [INFO] Tests run: 2, Failures: 0, Errors: 0, Skipped: 0, Time elapsed: 0.305 s - in ru.rshbintech.retail.frontsystem.efr.biz.ocrm.test.communications.integrations.controllers.CommunicationCallbackControllerTest
#17 106.0 06:16:55 [INFO] Running ru.rshbintech.retail.frontsystem.efr.biz.ocrm.test.communications.integrations.controllers.CommentControllerTest
#17 106.3 06:16:55 [INFO] Tests run: 5, Failures: 0, Errors: 0, Skipped: 0, Time elapsed: 0.268 s - in ru.rshbintech.retail.frontsystem.efr.biz.ocrm.test.communications.integrations.controllers.CommentControllerTest
#17 106.3 06:16:55 [INFO] Running ru.rshbintech.retail.frontsystem.efr.biz.ocrm.test.communications.integrations.controllers.SynchronizationControllerTest
#17 106.5 06:16:56 [INFO] Tests run: 8, Failures: 0, Errors: 0, Skipped: 0, Time elapsed: 0.187 s - in ru.rshbintech.retail.frontsystem.efr.biz.ocrm.test.communications.integrations.controllers.SynchronizationControllerTest
#17 106.5 06:16:56 [INFO] Running ru.rshbintech.retail.frontsystem.efr.biz.ocrm.test.communications.integrations.controllers.SmsOperationControllerTest
#17 106.5 06:16:56 [INFO] Tests run: 2, Failures: 0, Errors: 0, Skipped: 0, Time elapsed: 0.043 s - in ru.rshbintech.retail.frontsystem.efr.biz.ocrm.test.communications.integrations.controllers.SmsOperationControllerTest
#17 106.5 06:16:56 [INFO] Running ru.rshbintech.retail.frontsystem.efr.biz.ocrm.test.communications.integrations.controllers.ChatControllerTest
#17 106.9 06:16:56 [INFO] Tests run: 8, Failures: 0, Errors: 0, Skipped: 0, Time elapsed: 0.411 s - in ru.rshbintech.retail.frontsystem.efr.biz.ocrm.test.communications.integrations.controllers.ChatControllerTest
#17 106.9 06:16:56 [INFO] Running ru.rshbintech.retail.frontsystem.efr.biz.ocrm.test.communications.integrations.controllers.CdiControllerTest
#17 107.7 06:16:57 [INFO] Tests run: 1, Failures: 0, Errors: 0, Skipped: 0, Time elapsed: 0.74 s - in ru.rshbintech.retail.frontsystem.efr.biz.ocrm.test.communications.integrations.controllers.CdiControllerTest
#17 107.7 06:16:57 [INFO] Running ru.rshbintech.retail.frontsystem.efr.biz.ocrm.test.communications.integrations.controllers.OwnFinSynchronizationControllerTest
#17 107.8 06:16:57 [INFO] Tests run: 6, Failures: 0, Errors: 0, Skipped: 0, Time elapsed: 0.128 s - in ru.rshbintech.retail.frontsystem.efr.biz.ocrm.test.communications.integrations.controllers.OwnFinSynchronizationControllerTest
#17 107.8 06:16:57 [INFO] Running ru.rshbintech.retail.frontsystem.efr.biz.ocrm.test.communications.integrations.controllers.ExternalClaimControllerTest
#17 107.9 06:16:57 [INFO] Tests run: 2, Failures: 0, Errors: 0, Skipped: 0, Time elapsed: 0.096 s - in ru.rshbintech.retail.frontsystem.efr.biz.ocrm.test.communications.integrations.controllers.ExternalClaimControllerTest
#17 107.9 06:16:57 [INFO] Running ru.rshbintech.retail.frontsystem.efr.biz.ocrm.test.communications.integrations.controllers.CardOperationControllerTest
#17 108.3 06:16:58 [INFO] Tests run: 17, Failures: 0, Errors: 0, Skipped: 0, Time elapsed: 0.396 s - in ru.rshbintech.retail.frontsystem.efr.biz.ocrm.test.communications.integrations.controllers.CardOperationControllerTest
#17 108.3 06:16:58 [INFO] Running ru.rshbintech.retail.frontsystem.efr.biz.ocrm.test.communications.integrations.controllers.dictionaties.CardDboBlockingServiceStatusControllerTest
#17 108.6 06:16:58 [INFO] Tests run: 6, Failures: 0, Errors: 0, Skipped: 0, Time elapsed: 0.248 s - in ru.rshbintech.retail.frontsystem.efr.biz.ocrm.test.communications.integrations.controllers.dictionaties.CardDboBlockingServiceStatusControllerTest
#17 108.6 06:16:58 [INFO] Running ru.rshbintech.retail.frontsystem.efr.biz.ocrm.test.communications.integrations.controllers.dictionaties.ReportKindControllerTest
#17 108.8 06:16:58 [INFO] Tests run: 5, Failures: 0, Errors: 0, Skipped: 0, Time elapsed: 0.243 s - in ru.rshbintech.retail.frontsystem.efr.biz.ocrm.test.communications.integrations.controllers.dictionaties.ReportKindControllerTest
#17 108.8 06:16:58 [INFO] Running ru.rshbintech.retail.frontsystem.efr.biz.ocrm.test.communications.integrations.controllers.dictionaties.ConsentControllerTest
#17 109.0 06:16:58 [INFO] Tests run: 4, Failures: 0, Errors: 0, Skipped: 0, Time elapsed: 0.168 s - in ru.rshbintech.retail.frontsystem.efr.biz.ocrm.test.communications.integrations.controllers.dictionaties.ConsentControllerTest
#17 109.0 06:16:58 [INFO] Running ru.rshbintech.retail.frontsystem.efr.biz.ocrm.test.communications.integrations.controllers.dictionaties.CardDboBlockingServiceReasonControllerTest
#17 109.3 06:16:58 [INFO] Tests run: 6, Failures: 0, Errors: 0, Skipped: 0, Time elapsed: 0.264 s - in ru.rshbintech.retail.frontsystem.efr.biz.ocrm.test.communications.integrations.controllers.dictionaties.CardDboBlockingServiceReasonControllerTest
#17 109.3 06:16:58 [INFO] Running ru.rshbintech.retail.frontsystem.efr.biz.ocrm.test.communications.integrations.controllers.dictionaties.MessageCategoryControllerTest
#17 109.7 06:16:59 [INFO] Tests run: 7, Failures: 0, Errors: 0, Skipped: 0, Time elapsed: 0.441 s - in ru.rshbintech.retail.frontsystem.efr.biz.ocrm.test.communications.integrations.controllers.dictionaties.MessageCategoryControllerTest
#17 109.7 06:16:59 [INFO] Running ru.rshbintech.retail.frontsystem.efr.biz.ocrm.test.communications.integrations.controllers.dictionaties.RegisteredPhonesControllerTest
#17 110.1 06:16:59 [INFO] Tests run: 7, Failures: 0, Errors: 0, Skipped: 0, Time elapsed: 0.353 s - in ru.rshbintech.retail.frontsystem.efr.biz.ocrm.test.communications.integrations.controllers.dictionaties.RegisteredPhonesControllerTest
#17 110.1 06:16:59 [INFO] Running ru.rshbintech.retail.frontsystem.efr.biz.ocrm.test.communications.integrations.controllers.dictionaties.MessageTemplateControllerTest
#17 110.4 06:17:00 [INFO] Tests run: 5, Failures: 0, Errors: 0, Skipped: 0, Time elapsed: 0.358 s - in ru.rshbintech.retail.frontsystem.efr.biz.ocrm.test.communications.integrations.controllers.dictionaties.MessageTemplateControllerTest
#17 110.4 06:17:00 [INFO] Running ru.rshbintech.retail.frontsystem.efr.biz.ocrm.test.communications.integrations.controllers.dictionaties.CardOperationMssControllerTest
#17 110.7 06:17:00 [INFO] Tests run: 6, Failures: 0, Errors: 0, Skipped: 0, Time elapsed: 0.202 s - in ru.rshbintech.retail.frontsystem.efr.biz.ocrm.test.communications.integrations.controllers.dictionaties.CardOperationMssControllerTest
#17 110.7 06:17:00 [INFO] Running ru.rshbintech.retail.frontsystem.efr.biz.ocrm.test.communications.integrations.controllers.dictionaties.CommunicationChannelTest
#17 110.9 06:17:00 [WARNING] Tests run: 6, Failures: 0, Errors: 0, Skipped: 1, Time elapsed: 0.218 s - in ru.rshbintech.retail.frontsystem.efr.biz.ocrm.test.communications.integrations.controllers.dictionaties.CommunicationChannelTest
#17 110.9 06:17:00 [INFO] Running ru.rshbintech.retail.frontsystem.efr.biz.ocrm.test.communications.integrations.controllers.dictionaties.TopicControllerTest
#17 111.4 06:17:01 [INFO] Tests run: 12, Failures: 0, Errors: 0, Skipped: 0, Time elapsed: 0.526 s - in ru.rshbintech.retail.frontsystem.efr.biz.ocrm.test.communications.integrations.controllers.dictionaties.TopicControllerTest
#17 111.4 06:17:01 [INFO] Running ru.rshbintech.retail.frontsystem.efr.biz.ocrm.test.communications.integrations.controllers.AdditionalParamsControllerTest
#17 111.6 06:17:01 [INFO] Tests run: 4, Failures: 0, Errors: 0, Skipped: 0, Time elapsed: 0.178 s - in ru.rshbintech.retail.frontsystem.efr.biz.ocrm.test.communications.integrations.controllers.AdditionalParamsControllerTest
#17 111.6 06:17:01 [INFO] Running ru.rshbintech.retail.frontsystem.efr.biz.ocrm.test.communications.integrations.controllers.ChangeCardStatusControllerTest
#17 111.7 06:17:01 [INFO] Tests run: 2, Failures: 0, Errors: 0, Skipped: 0, Time elapsed: 0.057 s - in ru.rshbintech.retail.frontsystem.efr.biz.ocrm.test.communications.integrations.controllers.ChangeCardStatusControllerTest
#17 111.7 06:17:01 [INFO] Running ru.rshbintech.retail.frontsystem.efr.biz.ocrm.test.communications.integrations.controllers.ProjectServiceControllerTest
#17 111.9 06:17:01 [INFO] Tests run: 5, Failures: 0, Errors: 0, Skipped: 0, Time elapsed: 0.184 s - in ru.rshbintech.retail.frontsystem.efr.biz.ocrm.test.communications.integrations.controllers.ProjectServiceControllerTest
#17 111.9 06:17:01 [INFO] Running ru.rshbintech.retail.frontsystem.efr.biz.ocrm.test.communications.integrations.controllers.tasks.TaskTypeControllerTest
#17 112.1 06:17:01 [INFO] Tests run: 7, Failures: 0, Errors: 0, Skipped: 0, Time elapsed: 0.196 s - in ru.rshbintech.retail.frontsystem.efr.biz.ocrm.test.communications.integrations.controllers.tasks.TaskTypeControllerTest
#17 112.1 06:17:01 [INFO] Running ru.rshbintech.retail.frontsystem.efr.biz.ocrm.test.communications.integrations.controllers.tasks.TaskRegistriesControllerTest
#17 113.2 06:17:02 [INFO] Tests run: 15, Failures: 0, Errors: 0, Skipped: 0, Time elapsed: 1.091 s - in ru.rshbintech.retail.frontsystem.efr.biz.ocrm.test.communications.integrations.controllers.tasks.TaskRegistriesControllerTest
#17 113.2 06:17:02 [INFO] Running ru.rshbintech.retail.frontsystem.efr.biz.ocrm.test.communications.integrations.controllers.tasks.TaskChangeFieldsRuleControllerTest
#17 113.4 06:17:03 [INFO] Tests run: 6, Failures: 0, Errors: 0, Skipped: 0, Time elapsed: 0.183 s - in ru.rshbintech.retail.frontsystem.efr.biz.ocrm.test.communications.integrations.controllers.tasks.TaskChangeFieldsRuleControllerTest
#17 113.4 06:17:03 [INFO] Running ru.rshbintech.retail.frontsystem.efr.biz.ocrm.test.communications.integrations.controllers.tasks.RecipientControllerTest
#17 113.5 06:17:03 [INFO] Tests run: 6, Failures: 0, Errors: 0, Skipped: 0, Time elapsed: 0.18 s - in ru.rshbintech.retail.frontsystem.efr.biz.ocrm.test.communications.integrations.controllers.tasks.RecipientControllerTest
#17 113.5 06:17:03 [INFO] Running ru.rshbintech.retail.frontsystem.efr.biz.ocrm.test.communications.integrations.controllers.tasks.TaskControllerTest
#17 113.6 06:17:03 [INFO] Tests run: 2, Failures: 0, Errors: 0, Skipped: 0, Time elapsed: 0.104 s - in ru.rshbintech.retail.frontsystem.efr.biz.ocrm.test.communications.integrations.controllers.tasks.TaskControllerTest
#17 113.6 06:17:03 [INFO] Running ru.rshbintech.retail.frontsystem.efr.biz.ocrm.test.communications.integrations.controllers.tasks.TaskFieldControllerTest
#17 113.8 06:17:03 [INFO] Tests run: 5, Failures: 0, Errors: 0, Skipped: 0, Time elapsed: 0.144 s - in ru.rshbintech.retail.frontsystem.efr.biz.ocrm.test.communications.integrations.controllers.tasks.TaskFieldControllerTest
#17 113.8 06:17:03 [INFO] Running ru.rshbintech.retail.frontsystem.efr.biz.ocrm.test.communications.integrations.controllers.tasks.BankDivisionControllerTest
#17 114.0 06:17:03 [INFO] Tests run: 7, Failures: 0, Errors: 0, Skipped: 0, Time elapsed: 0.164 s - in ru.rshbintech.retail.frontsystem.efr.biz.ocrm.test.communications.integrations.controllers.tasks.BankDivisionControllerTest
#17 114.0 06:17:03 [INFO] Running ru.rshbintech.retail.frontsystem.efr.biz.ocrm.test.communications.integrations.controllers.tasks.TaskSaveRuleControllerTest
#17 114.2 06:17:03 [INFO] Tests run: 6, Failures: 0, Errors: 0, Skipped: 0, Time elapsed: 0.177 s - in ru.rshbintech.retail.frontsystem.efr.biz.ocrm.test.communications.integrations.controllers.tasks.TaskSaveRuleControllerTest
#17 114.2 06:17:03 [INFO] Running ru.rshbintech.retail.frontsystem.efr.biz.ocrm.test.communications.integrations.controllers.CommunicationControllerTest
#17 115.4 06:17:05 [WARNING] Tests run: 30, Failures: 0, Errors: 0, Skipped: 9, Time elapsed: 1.266 s - in ru.rshbintech.retail.frontsystem.efr.biz.ocrm.test.communications.integrations.controllers.CommunicationControllerTest
#17 115.4 06:17:05 [INFO] Running ru.rshbintech.retail.frontsystem.efr.biz.ocrm.test.communications.integrations.controllers.AppealControllerTest
#17 115.5 06:17:05 [WARNING] Tests run: 2, Failures: 0, Errors: 0, Skipped: 1, Time elapsed: 0.047 s - in ru.rshbintech.retail.frontsystem.efr.biz.ocrm.test.communications.integrations.controllers.AppealControllerTest
#17 115.5 06:17:05 [INFO] Running ru.rshbintech.retail.frontsystem.efr.biz.ocrm.test.communications.integrations.controllers.CardDboBlockingServiceControllerTest
#17 115.6 06:17:05 [INFO] Tests run: 4, Failures: 0, Errors: 0, Skipped: 0, Time elapsed: 0.072 s - in ru.rshbintech.retail.frontsystem.efr.biz.ocrm.test.communications.integrations.controllers.CardDboBlockingServiceControllerTest
#17 115.6 06:17:05 [INFO] Running ru.rshbintech.retail.frontsystem.efr.biz.ocrm.test.communications.unit.CurrencyServiceTest
#17 115.6 06:17:05 [INFO] Tests run: 5, Failures: 0, Errors: 0, Skipped: 0, Time elapsed: 0.054 s - in ru.rshbintech.retail.frontsystem.efr.biz.ocrm.test.communications.unit.CurrencyServiceTest
#17 115.6 06:17:05 [INFO] Running ru.rshbintech.retail.frontsystem.efr.biz.ocrm.test.communications.unit.EmployeesServiceTest
#17 115.7 06:17:05 [INFO] Tests run: 5, Failures: 0, Errors: 0, Skipped: 0, Time elapsed: 0.055 s - in ru.rshbintech.retail.frontsystem.efr.biz.ocrm.test.communications.unit.EmployeesServiceTest
#17 115.7 06:17:05 [INFO] Running ru.rshbintech.retail.frontsystem.efr.biz.ocrm.test.communications.unit.AppealsServiceTest
#17 115.7 06:17:05 [INFO] Tests run: 2, Failures: 0, Errors: 0, Skipped: 0, Time elapsed: 0 s - in ru.rshbintech.retail.frontsystem.efr.biz.ocrm.test.communications.unit.AppealsServiceTest
#17 115.7 06:17:05 [INFO] Running ru.rshbintech.retail.frontsystem.efr.biz.ocrm.test.communications.unit.GetCardOperationsByAccountIdServiceTest
#17 115.9 06:17:05 [INFO] Tests run: 2, Failures: 0, Errors: 0, Skipped: 0, Time elapsed: 0.177 s - in ru.rshbintech.retail.frontsystem.efr.biz.ocrm.test.communications.unit.GetCardOperationsByAccountIdServiceTest
#17 115.9 06:17:05 [INFO] Running ru.rshbintech.retail.frontsystem.efr.biz.ocrm.test.communications.unit.CommunicationsServiceTest
#17 118.1 06:17:07 [INFO] Tests run: 1, Failures: 0, Errors: 0, Skipped: 0, Time elapsed: 2.253 s - in ru.rshbintech.retail.frontsystem.efr.biz.ocrm.test.communications.unit.CommunicationsServiceTest
#17 118.1 06:17:07 [INFO] Running ru.rshbintech.retail.frontsystem.efr.biz.ocrm.test.communications.unit.blocking.pc.ChangeCardStatusRequestCreatorTest
#17 118.2 06:17:07 [INFO] Tests run: 3, Failures: 0, Errors: 0, Skipped: 0, Time elapsed: 0.022 s - in ru.rshbintech.retail.frontsystem.efr.biz.ocrm.test.communications.unit.blocking.pc.ChangeCardStatusRequestCreatorTest
#17 118.2 06:17:07 [INFO] Running ru.rshbintech.retail.frontsystem.efr.biz.ocrm.test.communications.unit.blocking.pc.ChangeCardStatusResponseHelperTest
#17 118.2 06:17:07 [INFO] Tests run: 4, Failures: 0, Errors: 0, Skipped: 0, Time elapsed: 0 s - in ru.rshbintech.retail.frontsystem.efr.biz.ocrm.test.communications.unit.blocking.pc.ChangeCardStatusResponseHelperTest
#17 118.2 06:17:07 [INFO] Running ru.rshbintech.retail.frontsystem.efr.biz.ocrm.test.communications.unit.dictionaries.ReportKindServiceTest
#17 118.2 06:17:07 [INFO] Tests run: 2, Failures: 0, Errors: 0, Skipped: 0, Time elapsed: 0.017 s - in ru.rshbintech.retail.frontsystem.efr.biz.ocrm.test.communications.unit.dictionaries.ReportKindServiceTest
#17 118.2 06:17:07 [INFO] Running ru.rshbintech.retail.frontsystem.efr.biz.ocrm.test.communications.unit.chat.UpdateDialogueServiceTest
#17 118.3 06:17:07 [INFO] Tests run: 4, Failures: 0, Errors: 0, Skipped: 0, Time elapsed: 0.047 s - in ru.rshbintech.retail.frontsystem.efr.biz.ocrm.test.communications.unit.chat.UpdateDialogueServiceTest
#17 118.3 06:17:07 [INFO] Running ru.rshbintech.retail.frontsystem.efr.biz.ocrm.test.communications.unit.chat.CreateDialogueReqBuilderTest
#17 118.3 06:17:07 [INFO] Tests run: 2, Failures: 0, Errors: 0, Skipped: 0, Time elapsed: 0.004 s - in ru.rshbintech.retail.frontsystem.efr.biz.ocrm.test.communications.unit.chat.CreateDialogueReqBuilderTest
#17 118.3 06:17:07 [INFO] Running ru.rshbintech.retail.frontsystem.efr.biz.ocrm.test.communications.unit.chat.CreateDialogueServiceTest
#17 118.3 06:17:07 [INFO] Tests run: 2, Failures: 0, Errors: 0, Skipped: 0, Time elapsed: 0 s - in ru.rshbintech.retail.frontsystem.efr.biz.ocrm.test.communications.unit.chat.CreateDialogueServiceTest
#17 118.3 06:17:07 [INFO] Running ru.rshbintech.retail.frontsystem.efr.biz.ocrm.test.communications.unit.chat.UpdateDialogueReqBuilderTest
#17 118.3 06:17:07 [INFO] Tests run: 2, Failures: 0, Errors: 0, Skipped: 0, Time elapsed: 0 s - in ru.rshbintech.retail.frontsystem.efr.biz.ocrm.test.communications.unit.chat.UpdateDialogueReqBuilderTest
#17 118.3 06:17:07 [INFO] Running ru.rshbintech.retail.frontsystem.efr.biz.ocrm.test.communications.unit.chat.AppealProcessingServiceTest
#17 118.3 06:17:08 [INFO] Tests run: 6, Failures: 0, Errors: 0, Skipped: 0, Time elapsed: 0.031 s - in ru.rshbintech.retail.frontsystem.efr.biz.ocrm.test.communications.unit.chat.AppealProcessingServiceTest
#17 118.3 06:17:08 [INFO] Running ru.rshbintech.retail.frontsystem.efr.biz.ocrm.test.communications.unit.card.operations.CardOperationFilterTest
#17 118.3 06:17:08 [INFO] Tests run: 11, Failures: 0, Errors: 0, Skipped: 0, Time elapsed: 0.003 s - in ru.rshbintech.retail.frontsystem.efr.biz.ocrm.test.communications.unit.card.operations.CardOperationFilterTest
#17 118.3 06:17:08 [INFO] Running ru.rshbintech.retail.frontsystem.efr.biz.ocrm.test.communications.unit.card.operations.CardOperationMssNameAppenderTest
#17 118.4 06:17:08 [INFO] Tests run: 3, Failures: 0, Errors: 0, Skipped: 0, Time elapsed: 0.018 s - in ru.rshbintech.retail.frontsystem.efr.biz.ocrm.test.communications.unit.card.operations.CardOperationMssNameAppenderTest
#17 118.4 06:17:08 [INFO] Running ru.rshbintech.retail.frontsystem.efr.biz.ocrm.test.communications.unit.database.repositories.BankDivisionsTempRepositoryTest
#17 118.5
#17 118.5 . ____ _ __ _ _
#17 118.5 /\\ / ___'_ __ _ _(_)_ __ __ _ \ \ \ \
#17 118.5 ( ( )\___ | '_ | '_| | '_ \/ _` | \ \ \ \
#17 118.5 \\/ ___)| |_)| | | | | || (_| | ) ) ) )
#17 118.5 ' |____| .__|_| |_|_| |_\__, | / / / /
#17 118.5 =========|_|==============|___/=/_/_/_/
#17 118.5 :: Spring Boot :: (v2.7.1)
#17 118.5
#17 120.7 06:17:10 [INFO] Tests run: 2, Failures: 0, Errors: 0, Skipped: 0, Time elapsed: 2.384 s - in ru.rshbintech.retail.frontsystem.efr.biz.ocrm.test.communications.unit.database.repositories.BankDivisionsTempRepositoryTest
#17 120.7 06:17:10 [INFO] Running ru.rshbintech.retail.frontsystem.efr.biz.ocrm.test.communications.unit.database.repositories.ClientRepositoryTest
#17 120.9 06:17:10 [INFO] Tests run: 5, Failures: 0, Errors: 0, Skipped: 0, Time elapsed: 0.108 s - in ru.rshbintech.retail.frontsystem.efr.biz.ocrm.test.communications.unit.database.repositories.ClientRepositoryTest
#17 120.9 06:17:10 [INFO] Running ru.rshbintech.retail.frontsystem.efr.biz.ocrm.test.communications.unit.database.repositories.CommunicationCallbackRepositoryTest
#17 120.9 06:17:10 [INFO] Tests run: 2, Failures: 0, Errors: 0, Skipped: 0, Time elapsed: 0.027 s - in ru.rshbintech.retail.frontsystem.efr.biz.ocrm.test.communications.unit.database.repositories.CommunicationCallbackRepositoryTest
#17 120.9 06:17:10 [INFO] Running ru.rshbintech.retail.frontsystem.efr.biz.ocrm.test.communications.unit.database.repositories.RefusalConsentRepositoryTest
#17 120.9 06:17:10 [INFO] Tests run: 4, Failures: 0, Errors: 0, Skipped: 0, Time elapsed: 0.039 s - in ru.rshbintech.retail.frontsystem.efr.biz.ocrm.test.communications.unit.database.repositories.RefusalConsentRepositoryTest
#17 120.9 06:17:10 [INFO] Running ru.rshbintech.retail.frontsystem.efr.biz.ocrm.test.communications.unit.database.repositories.BankDivisionsRepositoryTest
#17 121.1 06:17:10 [INFO] Tests run: 10, Failures: 0, Errors: 0, Skipped: 0, Time elapsed: 0.151 s - in ru.rshbintech.retail.frontsystem.efr.biz.ocrm.test.communications.unit.database.repositories.BankDivisionsRepositoryTest
#17 121.1 06:17:10 [INFO] Running ru.rshbintech.retail.frontsystem.efr.biz.ocrm.test.communications.unit.database.repositories.ClientConsentRepositoryTest
#17 121.1 06:17:10 [INFO] Tests run: 2, Failures: 0, Errors: 0, Skipped: 0, Time elapsed: 0.022 s - in ru.rshbintech.retail.frontsystem.efr.biz.ocrm.test.communications.unit.database.repositories.ClientConsentRepositoryTest
#17 121.1 06:17:10 [INFO] Running ru.rshbintech.retail.frontsystem.efr.biz.ocrm.test.communications.unit.database.repositories.BlockingDboRepositoryTest
#17 121.2 06:17:10 [INFO] Tests run: 1, Failures: 0, Errors: 0, Skipped: 0, Time elapsed: 0.018 s - in ru.rshbintech.retail.frontsystem.efr.biz.ocrm.test.communications.unit.database.repositories.BlockingDboRepositoryTest
#17 121.2 06:17:10 [INFO] Running ru.rshbintech.retail.frontsystem.efr.biz.ocrm.test.communications.unit.database.repositories.RecipientsRepositoryTest
#17 121.2 06:17:10 [INFO] Tests run: 1, Failures: 0, Errors: 0, Skipped: 0, Time elapsed: 0.018 s - in ru.rshbintech.retail.frontsystem.efr.biz.ocrm.test.communications.unit.database.repositories.RecipientsRepositoryTest
#17 121.2 06:17:10 [INFO] Running ru.rshbintech.retail.frontsystem.efr.biz.ocrm.test.communications.unit.database.repositories.AppealsRepositoryTest
#17 121.2 06:17:10 [INFO] Tests run: 2, Failures: 0, Errors: 0, Skipped: 0, Time elapsed: 0.022 s - in ru.rshbintech.retail.frontsystem.efr.biz.ocrm.test.communications.unit.database.repositories.AppealsRepositoryTest
#17 121.2 06:17:10 [INFO] Running ru.rshbintech.retail.frontsystem.efr.biz.ocrm.test.communications.unit.database.repositories.ReportKindRepositoryTest
#17 121.2 06:17:10 [INFO] Tests run: 2, Failures: 0, Errors: 0, Skipped: 0, Time elapsed: 0.028 s - in ru.rshbintech.retail.frontsystem.efr.biz.ocrm.test.communications.unit.database.repositories.ReportKindRepositoryTest
#17 121.2 06:17:10 [INFO] Running ru.rshbintech.retail.frontsystem.efr.biz.ocrm.test.communications.unit.database.repositories.CommunicationsRepositoryTest
#17 121.3 06:17:11 [INFO] Tests run: 6, Failures: 0, Errors: 0, Skipped: 0, Time elapsed: 0.081 s - in ru.rshbintech.retail.frontsystem.efr.biz.ocrm.test.communications.unit.database.repositories.CommunicationsRepositoryTest
#17 121.3 06:17:11 [INFO] Running ru.rshbintech.retail.frontsystem.efr.biz.ocrm.test.communications.unit.database.repositories.TaskFieldsRepositoryTest
#17 121.4 06:17:11 [INFO] Tests run: 3, Failures: 0, Errors: 0, Skipped: 0, Time elapsed: 0.043 s - in ru.rshbintech.retail.frontsystem.efr.biz.ocrm.test.communications.unit.database.repositories.TaskFieldsRepositoryTest
#17 121.4 06:17:11 [INFO] Running ru.rshbintech.retail.frontsystem.efr.biz.ocrm.test.communications.unit.database.repositories.BlockingCardRepositoryTest
#17 121.5 06:17:11 [INFO] Tests run: 4, Failures: 0, Errors: 0, Skipped: 0, Time elapsed: 0.056 s - in ru.rshbintech.retail.frontsystem.efr.biz.ocrm.test.communications.unit.database.repositories.BlockingCardRepositoryTest
#17 121.5 06:17:11 [INFO] Running ru.rshbintech.retail.frontsystem.efr.biz.ocrm.test.communications.unit.database.specifications.ClientRegisterSpecificationTest
#17 121.5 06:17:11 [INFO] Tests run: 1, Failures: 0, Errors: 0, Skipped: 0, Time elapsed: 0.011 s - in ru.rshbintech.retail.frontsystem.efr.biz.ocrm.test.communications.unit.database.specifications.ClientRegisterSpecificationTest
#17 121.5 06:17:11 [INFO] Running ru.rshbintech.retail.frontsystem.efr.biz.ocrm.test.communications.unit.database.specifications.CommunicationChannelSpecificationTest
#17 121.5 06:17:11 [INFO] Tests run: 1, Failures: 0, Errors: 0, Skipped: 0, Time elapsed: 0.013 s - in ru.rshbintech.retail.frontsystem.efr.biz.ocrm.test.communications.unit.database.specifications.CommunicationChannelSpecificationTest
#17 121.5 06:17:11 [INFO] Running ru.rshbintech.retail.frontsystem.efr.biz.ocrm.test.communications.unit.database.services.SiebelAppealsServiceTest
#17 121.5 06:17:11 [INFO] Tests run: 4, Failures: 0, Errors: 0, Skipped: 0, Time elapsed: 0.054 s - in ru.rshbintech.retail.frontsystem.efr.biz.ocrm.test.communications.unit.database.services.SiebelAppealsServiceTest
#17 121.5 06:17:11 [INFO] Running ru.rshbintech.retail.frontsystem.efr.biz.ocrm.test.communications.unit.database.services.RefusalConsentServiceTest
#17 121.6 06:17:11 [INFO] Tests run: 3, Failures: 0, Errors: 0, Skipped: 0, Time elapsed: 0.032 s - in ru.rshbintech.retail.frontsystem.efr.biz.ocrm.test.communications.unit.database.services.RefusalConsentServiceTest
#17 121.6 06:17:11 [INFO] Running ru.rshbintech.retail.frontsystem.efr.biz.ocrm.test.communications.unit.database.services.ClientsServiceTest
#17 121.6
#17 121.6 . ____ _ __ _ _
#17 121.6 /\\ / ___'_ __ _ _(_)_ __ __ _ \ \ \ \
#17 121.6 ( ( )\___ | '_ | '_| | '_ \/ _` | \ \ \ \
#17 121.6 \\/ ___)| |_)| | | | | || (_| | ) ) ) )
#17 121.6 ' |____| .__|_| |_|_| |_\__, | / / / /
#17 121.6 =========|_|==============|___/=/_/_/_/
#17 121.6 :: Spring Boot :: (v2.7.1)
#17 121.6
#17 123.8 06:17:13 [INFO] Tests run: 3, Failures: 0, Errors: 0, Skipped: 0, Time elapsed: 2.168 s - in ru.rshbintech.retail.frontsystem.efr.biz.ocrm.test.communications.unit.database.services.ClientsServiceTest
#17 123.8 06:17:13 [INFO] Running ru.rshbintech.retail.frontsystem.efr.biz.ocrm.test.communications.unit.database.services.CrmAppealsServiceTest
#17 123.8 06:17:13 [INFO] Tests run: 4, Failures: 0, Errors: 0, Skipped: 0, Time elapsed: 0.058 s - in ru.rshbintech.retail.frontsystem.efr.biz.ocrm.test.communications.unit.database.services.CrmAppealsServiceTest
#17 123.8 06:17:13 [INFO] Running ru.rshbintech.retail.frontsystem.efr.biz.ocrm.test.communications.unit.database.services.CommunicationChannelsServiceTest
#17 123.9 06:17:13 [INFO] Tests run: 5, Failures: 0, Errors: 0, Skipped: 0, Time elapsed: 0.101 s - in ru.rshbintech.retail.frontsystem.efr.biz.ocrm.test.communications.unit.database.services.CommunicationChannelsServiceTest
#17 123.9 06:17:13 [INFO] Running ru.rshbintech.retail.frontsystem.efr.biz.ocrm.test.communications.unit.frequency.FrequentCustomerServiceTest
#17 123.9 06:17:13 [INFO] Tests run: 4, Failures: 0, Errors: 0, Skipped: 0, Time elapsed: 0 s - in ru.rshbintech.retail.frontsystem.efr.biz.ocrm.test.communications.unit.frequency.FrequentCustomerServiceTest
#17 123.9 06:17:13 [INFO] Running ru.rshbintech.retail.frontsystem.efr.biz.ocrm.test.communications.unit.ProcessUtilsTest
#17 124.0 06:17:13 [INFO] Tests run: 3, Failures: 0, Errors: 0, Skipped: 0, Time elapsed: 0.043 s - in ru.rshbintech.retail.frontsystem.efr.biz.ocrm.test.communications.unit.ProcessUtilsTest
#17 124.0 06:17:13 [INFO] Running ru.rshbintech.retail.frontsystem.efr.biz.ocrm.test.communications.unit.synchronization.CrmAppealMappingServiceTest
#17 124.0 06:17:13 [INFO] Tests run: 6, Failures: 0, Errors: 0, Skipped: 0, Time elapsed: 0.015 s - in ru.rshbintech.retail.frontsystem.efr.biz.ocrm.test.communications.unit.synchronization.CrmAppealMappingServiceTest
#17 124.0 06:17:13 [INFO] Running ru.rshbintech.retail.frontsystem.efr.biz.ocrm.test.communications.unit.synchronization.CommunicationCreatorTest
#17 124.0 06:17:13 [INFO] Tests run: 5, Failures: 0, Errors: 0, Skipped: 0, Time elapsed: 0.009 s - in ru.rshbintech.retail.frontsystem.efr.biz.ocrm.test.communications.unit.synchronization.CommunicationCreatorTest
#17 124.0 06:17:13 [INFO] Running ru.rshbintech.retail.frontsystem.efr.biz.ocrm.test.communications.unit.synchronization.AppealCreatorTest
#17 124.1 06:17:13 [INFO] Tests run: 3, Failures: 0, Errors: 0, Skipped: 0, Time elapsed: 0.011 s - in ru.rshbintech.retail.frontsystem.efr.biz.ocrm.test.communications.unit.synchronization.AppealCreatorTest
#17 124.1 06:17:13 [INFO] Running ru.rshbintech.retail.frontsystem.efr.biz.ocrm.test.communications.unit.synchronization.ClientFinderTest
#17 124.1 06:17:13 [INFO] Tests run: 11, Failures: 0, Errors: 0, Skipped: 0, Time elapsed: 0.09 s - in ru.rshbintech.retail.frontsystem.efr.biz.ocrm.test.communications.unit.synchronization.ClientFinderTest
#17 124.2 06:17:13 [INFO] Running ru.rshbintech.retail.frontsystem.efr.biz.ocrm.test.communications.unit.synchronization.ToSiebelSynchronizationServiceTest
#17 124.2 06:17:13 [INFO] Tests run: 4, Failures: 0, Errors: 0, Skipped: 0, Time elapsed: 0.029 s - in ru.rshbintech.retail.frontsystem.efr.biz.ocrm.test.communications.unit.synchronization.ToSiebelSynchronizationServiceTest
#17 124.2 06:17:13 [INFO] Running ru.rshbintech.retail.frontsystem.efr.biz.ocrm.test.communications.unit.synchronization.TopicsExportCheckerTest
#17 124.2 06:17:13 [INFO] Tests run: 5, Failures: 0, Errors: 0, Skipped: 0, Time elapsed: 0 s - in ru.rshbintech.retail.frontsystem.efr.biz.ocrm.test.communications.unit.synchronization.TopicsExportCheckerTest
#17 124.2 06:17:13 [INFO] Running ru.rshbintech.retail.frontsystem.efr.biz.ocrm.test.communications.unit.synchronization.ToOwnFinSynchronizationServiceTest
#17 124.2 06:17:13 [INFO] Tests run: 3, Failures: 0, Errors: 0, Skipped: 0, Time elapsed: 0.002 s - in ru.rshbintech.retail.frontsystem.efr.biz.ocrm.test.communications.unit.synchronization.ToOwnFinSynchronizationServiceTest
#17 124.2 06:17:13 [INFO] Running ru.rshbintech.retail.frontsystem.efr.biz.ocrm.test.communications.unit.synchronization.SynchronizationControllerUnitTest
#17 124.2 06:17:13 [INFO] Tests run: 3, Failures: 0, Errors: 0, Skipped: 0, Time elapsed: 0.004 s - in ru.rshbintech.retail.frontsystem.efr.biz.ocrm.test.communications.unit.synchronization.SynchronizationControllerUnitTest
#17 124.2 06:17:13 [INFO] Running ru.rshbintech.retail.frontsystem.efr.biz.ocrm.test.communications.unit.synchronization.FromSiebelSynchronizationServiceTest
#17 124.2 06:17:13 [INFO] Tests run: 3, Failures: 0, Errors: 0, Skipped: 0, Time elapsed: 0.014 s - in ru.rshbintech.retail.frontsystem.efr.biz.ocrm.test.communications.unit.synchronization.FromSiebelSynchronizationServiceTest
#17 124.2 06:17:13 [INFO] Running ru.rshbintech.retail.frontsystem.efr.biz.ocrm.test.communications.unit.reporting.ReportPrintServiceTest
#17 124.4 06:17:14 [INFO] Tests run: 2, Failures: 0, Errors: 0, Skipped: 0, Time elapsed: 0.152 s - in ru.rshbintech.retail.frontsystem.efr.biz.ocrm.test.communications.unit.reporting.ReportPrintServiceTest
#17 124.4 06:17:14 [INFO] Running ru.rshbintech.retail.frontsystem.efr.biz.ocrm.test.communications.unit.reporting.validators.StatementValidatorTest
#17 124.4 06:17:14 [INFO] Tests run: 6, Failures: 0, Errors: 0, Skipped: 0, Time elapsed: 0 s - in ru.rshbintech.retail.frontsystem.efr.biz.ocrm.test.communications.unit.reporting.validators.StatementValidatorTest
#17 124.4 06:17:14 [INFO] Running ru.rshbintech.retail.frontsystem.efr.biz.ocrm.test.communications.unit.reporting.validators.ScheduleValidatorTest
#17 124.4 06:17:14 [INFO] Tests run: 5, Failures: 0, Errors: 0, Skipped: 0, Time elapsed: 0 s - in ru.rshbintech.retail.frontsystem.efr.biz.ocrm.test.communications.unit.reporting.validators.ScheduleValidatorTest
#17 124.4 06:17:14 [INFO] Running ru.rshbintech.retail.frontsystem.efr.biz.ocrm.test.communications.unit.reporting.appenders.ClientDataAppenderTest
#17 124.4 06:17:14 [INFO] Tests run: 4, Failures: 0, Errors: 0, Skipped: 0, Time elapsed: 0 s - in ru.rshbintech.retail.frontsystem.efr.biz.ocrm.test.communications.unit.reporting.appenders.ClientDataAppenderTest
#17 124.4 06:17:14 [INFO] Running ru.rshbintech.retail.frontsystem.efr.biz.ocrm.test.communications.unit.reporting.appenders.CftClientDataAppenderTest
#17 124.4 06:17:14 [INFO] Tests run: 2, Failures: 0, Errors: 0, Skipped: 0, Time elapsed: 0 s - in ru.rshbintech.retail.frontsystem.efr.biz.ocrm.test.communications.unit.reporting.appenders.CftClientDataAppenderTest
#17 124.4 06:17:14 [INFO] Running ru.rshbintech.retail.frontsystem.efr.biz.ocrm.test.communications.unit.reporting.ReportSendServiceTest
#17 124.4 06:17:14 [INFO] Tests run: 2, Failures: 0, Errors: 0, Skipped: 0, Time elapsed: 0 s - in ru.rshbintech.retail.frontsystem.efr.biz.ocrm.test.communications.unit.reporting.ReportSendServiceTest
#17 124.4 06:17:14 [INFO] Running ru.rshbintech.retail.frontsystem.efr.biz.ocrm.test.communications.unit.reporting.helpers.CardOperationFilterHelperTest
#17 124.4 06:17:14 [INFO] Tests run: 6, Failures: 0, Errors: 0, Skipped: 0, Time elapsed: 0 s - in ru.rshbintech.retail.frontsystem.efr.biz.ocrm.test.communications.unit.reporting.helpers.CardOperationFilterHelperTest
#17 124.4 06:17:14 [INFO] Running ru.rshbintech.retail.frontsystem.efr.biz.ocrm.test.communications.unit.reporting.ReportDataGeneratorFactoryTest
#17 124.5
#17 124.5 . ____ _ __ _ _
#17 124.5 /\\ / ___'_ __ _ _(_)_ __ __ _ \ \ \ \
#17 124.5 ( ( )\___ | '_ | '_| | '_ \/ _` | \ \ \ \
#17 124.5 \\/ ___)| |_)| | | | | || (_| | ) ) ) )
#17 124.5 ' |____| .__|_| |_|_| |_\__, | / / / /
#17 124.5 =========|_|==============|___/=/_/_/_/
#17 124.5 :: Spring Boot :: (v2.7.1)
#17 124.5
#17 124.6 06:17:14 [INFO] Tests run: 5, Failures: 0, Errors: 0, Skipped: 0, Time elapsed: 0.201 s - in ru.rshbintech.retail.frontsystem.efr.biz.ocrm.test.communications.unit.reporting.ReportDataGeneratorFactoryTest
#17 124.6 06:17:14 [INFO] Running ru.rshbintech.retail.frontsystem.efr.biz.ocrm.test.communications.unit.reporting.ReportServiceTest
#17 124.6 06:17:14 [INFO] Tests run: 1, Failures: 0, Errors: 0, Skipped: 0, Time elapsed: 0.008 s - in ru.rshbintech.retail.frontsystem.efr.biz.ocrm.test.communications.unit.reporting.ReportServiceTest
#17 124.6 06:17:14 [INFO] Running ru.rshbintech.retail.frontsystem.efr.biz.ocrm.test.communications.unit.reporting.generators.AccountStatementReportDataGeneratorTest
#17 124.7 06:17:14 [INFO] Tests run: 3, Failures: 0, Errors: 0, Skipped: 0, Time elapsed: 0.003 s - in ru.rshbintech.retail.frontsystem.efr.biz.ocrm.test.communications.unit.reporting.generators.AccountStatementReportDataGeneratorTest
#17 124.7 06:17:14 [INFO] Running ru.rshbintech.retail.frontsystem.efr.biz.ocrm.test.communications.unit.reporting.generators.CreditPaymentScheduleReportDataGeneratorTest
#17 124.7 06:17:14 [INFO] Tests run: 3, Failures: 0, Errors: 0, Skipped: 0, Time elapsed: 0.005 s - in ru.rshbintech.retail.frontsystem.efr.biz.ocrm.test.communications.unit.reporting.generators.CreditPaymentScheduleReportDataGeneratorTest
#17 124.7 06:17:14 [INFO] Running ru.rshbintech.retail.frontsystem.efr.biz.ocrm.test.communications.unit.reporting.generators.CardAccountStatementReportDataGeneratorTest
#17 124.7 06:17:14 [INFO] Tests run: 3, Failures: 0, Errors: 0, Skipped: 0, Time elapsed: 0.012 s - in ru.rshbintech.retail.frontsystem.efr.biz.ocrm.test.communications.unit.reporting.generators.CardAccountStatementReportDataGeneratorTest
#17 124.7 06:17:14 [INFO] Running ru.rshbintech.retail.frontsystem.efr.biz.ocrm.test.communications.unit.builders.CardOperationsBuilderTest
#17 124.7 06:17:14 [INFO] Tests run: 1, Failures: 0, Errors: 0, Skipped: 0, Time elapsed: 0 s - in ru.rshbintech.retail.frontsystem.efr.biz.ocrm.test.communications.unit.builders.CardOperationsBuilderTest
#17 124.7 06:17:14 [INFO] Running ru.rshbintech.retail.frontsystem.efr.biz.ocrm.test.communications.unit.builders.BlockingDboBuilderTest
#17 124.7 06:17:14 [INFO] Tests run: 2, Failures: 0, Errors: 0, Skipped: 0, Time elapsed: 0 s - in ru.rshbintech.retail.frontsystem.efr.biz.ocrm.test.communications.unit.builders.BlockingDboBuilderTest
#17 124.7 06:17:14 [INFO] Running ru.rshbintech.retail.frontsystem.efr.biz.ocrm.test.communications.unit.builders.GetCreditDetailsByIdResponseBuilderTest
#17 124.7 06:17:14 [INFO] Tests run: 5, Failures: 0, Errors: 0, Skipped: 0, Time elapsed: 0.021 s - in ru.rshbintech.retail.frontsystem.efr.biz.ocrm.test.communications.unit.builders.GetCreditDetailsByIdResponseBuilderTest
#17 124.7 06:17:14 [INFO] Running ru.rshbintech.retail.frontsystem.efr.biz.ocrm.test.communications.unit.builders.GetCreditDetailsByIdRequestBuilderTest
#17 124.7 06:17:14 [INFO] Tests run: 2, Failures: 0, Errors: 0, Skipped: 0, Time elapsed: 0 s - in ru.rshbintech.retail.frontsystem.efr.biz.ocrm.test.communications.unit.builders.GetCreditDetailsByIdRequestBuilderTest
#17 124.7 06:17:14 [INFO] Running ru.rshbintech.retail.frontsystem.efr.biz.ocrm.test.communications.unit.builders.GetTokenCardListMapperTest
#17 124.7 06:17:14 [INFO] Tests run: 3, Failures: 0, Errors: 0, Skipped: 0, Time elapsed: 0.001 s - in ru.rshbintech.retail.frontsystem.efr.biz.ocrm.test.communications.unit.builders.GetTokenCardListMapperTest
#17 124.7 06:17:14 [INFO] Running ru.rshbintech.retail.frontsystem.efr.biz.ocrm.test.communications.unit.builders.BlockingCardBuilderTest
#17 124.7 06:17:14 [INFO] Tests run: 2, Failures: 0, Errors: 0, Skipped: 0, Time elapsed: 0.001 s - in ru.rshbintech.retail.frontsystem.efr.biz.ocrm.test.communications.unit.builders.BlockingCardBuilderTest
#17 124.7 06:17:14 [INFO] Running ru.rshbintech.retail.frontsystem.efr.biz.ocrm.test.communications.unit.builders.ClientBuilderTest
#17 124.7 06:17:14 [INFO] Tests run: 1, Failures: 0, Errors: 0, Skipped: 0, Time elapsed: 0 s - in ru.rshbintech.retail.frontsystem.efr.biz.ocrm.test.communications.unit.builders.ClientBuilderTest
#17 124.7 06:17:14 [INFO] Running ru.rshbintech.retail.frontsystem.efr.biz.ocrm.test.communications.unit.builders.ChangeTokenStatusMapperTest
#17 124.8 06:17:14 [INFO] Tests run: 2, Failures: 0, Errors: 0, Skipped: 0, Time elapsed: 0 s - in ru.rshbintech.retail.frontsystem.efr.biz.ocrm.test.communications.unit.builders.ChangeTokenStatusMapperTest
#17 124.8 06:17:14 [INFO] Running ru.rshbintech.retail.frontsystem.efr.biz.ocrm.test.communications.unit.builders.TemplateNoticeEmailBuilderTest
#17 124.8 06:17:14 [INFO] Tests run: 1, Failures: 0, Errors: 0, Skipped: 0, Time elapsed: 0 s - in ru.rshbintech.retail.frontsystem.efr.biz.ocrm.test.communications.unit.builders.TemplateNoticeEmailBuilderTest
#17 124.8 06:17:14 [INFO] Running ru.rshbintech.retail.frontsystem.efr.biz.ocrm.test.communications.unit.builders.GetCardOperationsBuilderTest
#17 124.8 06:17:14 [INFO] Tests run: 1, Failures: 0, Errors: 0, Skipped: 0, Time elapsed: 0.001 s - in ru.rshbintech.retail.frontsystem.efr.biz.ocrm.test.communications.unit.builders.GetCardOperationsBuilderTest
#17 124.8 06:17:14 [INFO] Running ru.rshbintech.retail.frontsystem.efr.biz.ocrm.test.communications.unit.config.PcConfigTest
#17 124.8 06:17:14 [INFO] Tests run: 4, Failures: 0, Errors: 0, Skipped: 0, Time elapsed: 0 s - in ru.rshbintech.retail.frontsystem.efr.biz.ocrm.test.communications.unit.config.PcConfigTest
#17 124.8 06:17:14 [INFO] Running ru.rshbintech.retail.frontsystem.efr.biz.ocrm.test.communications.unit.CommentAppenderTest
#17 124.8 06:17:14 [INFO] Tests run: 1, Failures: 0, Errors: 0, Skipped: 0, Time elapsed: 0 s - in ru.rshbintech.retail.frontsystem.efr.biz.ocrm.test.communications.unit.CommentAppenderTest
#17 124.8 06:17:14 [INFO] Running ru.rshbintech.retail.frontsystem.efr.biz.ocrm.test.communications.unit.ClientConsentServiceTest
#17 124.8 06:17:14 [INFO] Tests run: 9, Failures: 0, Errors: 0, Skipped: 0, Time elapsed: 0.01 s - in ru.rshbintech.retail.frontsystem.efr.biz.ocrm.test.communications.unit.ClientConsentServiceTest
#17 124.8 06:17:14 [INFO] Running ru.rshbintech.retail.frontsystem.efr.biz.ocrm.test.communications.unit.processes.delegates.registration.appeal.TopicSelectorAdapterTest
#17 124.8 06:17:14 [INFO] Tests run: 2, Failures: 0, Errors: 0, Skipped: 0, Time elapsed: 0 s - in ru.rshbintech.retail.frontsystem.efr.biz.ocrm.test.communications.unit.processes.delegates.registration.appeal.TopicSelectorAdapterTest
#17 124.8 06:17:14 [INFO] Running ru.rshbintech.retail.frontsystem.efr.biz.ocrm.test.communications.unit.processes.delegates.blocking.ChooseProductsAdapterTest
#17 124.8 06:17:14 [INFO] Tests run: 4, Failures: 0, Errors: 0, Skipped: 0, Time elapsed: 0.001 s - in ru.rshbintech.retail.frontsystem.efr.biz.ocrm.test.communications.unit.processes.delegates.blocking.ChooseProductsAdapterTest
#17 124.8 06:17:14 [INFO] Running ru.rshbintech.retail.frontsystem.efr.biz.ocrm.test.communications.unit.processes.delegates.blocking.SendRequestToBlockDboDelegateTest
#17 124.8 06:17:14 [INFO] Tests run: 8, Failures: 0, Errors: 0, Skipped: 0, Time elapsed: 0.014 s - in ru.rshbintech.retail.frontsystem.efr.biz.ocrm.test.communications.unit.processes.delegates.blocking.SendRequestToBlockDboDelegateTest
#17 124.8 06:17:14 [INFO] Running ru.rshbintech.retail.frontsystem.efr.biz.ocrm.test.communications.unit.processes.delegates.cdi.SendRequestToConsentCancelDelegateTest
#17 124.9 06:17:14 [INFO] Tests run: 2, Failures: 0, Errors: 0, Skipped: 0, Time elapsed: 0.017 s - in ru.rshbintech.retail.frontsystem.efr.biz.ocrm.test.communications.unit.processes.delegates.cdi.SendRequestToConsentCancelDelegateTest
#17 124.9 06:17:14 [INFO] Running ru.rshbintech.retail.frontsystem.efr.biz.ocrm.test.communications.unit.processes.delegates.cdi.ConfirmConsentCancelAdapterTest
#17 124.9 06:17:14 [INFO] Tests run: 4, Failures: 0, Errors: 0, Skipped: 0, Time elapsed: 0.006 s - in ru.rshbintech.retail.frontsystem.efr.biz.ocrm.test.communications.unit.processes.delegates.cdi.ConfirmConsentCancelAdapterTest
#17 124.9 06:17:14 [INFO] Running ru.rshbintech.retail.frontsystem.efr.biz.ocrm.test.communications.unit.processes.delegates.common.CreateCommentAboutAppealDelegateTest
#17 124.9 06:17:14 [INFO] Tests run: 1, Failures: 0, Errors: 0, Skipped: 0, Time elapsed: 0.001 s - in ru.rshbintech.retail.frontsystem.efr.biz.ocrm.test.communications.unit.processes.delegates.common.CreateCommentAboutAppealDelegateTest
#17 124.9 06:17:14 [INFO] Running ru.rshbintech.retail.frontsystem.efr.biz.ocrm.test.communications.unit.processes.delegates.report.sending.SetAppealStatusDelegateTest
#17 124.9 06:17:14 [INFO] Tests run: 2, Failures: 0, Errors: 0, Skipped: 0, Time elapsed: 0.004 s - in ru.rshbintech.retail.frontsystem.efr.biz.ocrm.test.communications.unit.processes.delegates.report.sending.SetAppealStatusDelegateTest
#17 124.9 06:17:14 [INFO] Running ru.rshbintech.retail.frontsystem.efr.biz.ocrm.test.communications.unit.processes.delegates.report.sending.InputParamsAdapterTest
#17 124.9 06:17:14 [INFO] Tests run: 2, Failures: 0, Errors: 0, Skipped: 0, Time elapsed: 0 s - in ru.rshbintech.retail.frontsystem.efr.biz.ocrm.test.communications.unit.processes.delegates.report.sending.InputParamsAdapterTest
#17 124.9 06:17:14 [INFO] Running ru.rshbintech.retail.frontsystem.efr.biz.ocrm.test.communications.unit.processes.delegates.report.sending.ProcessStartHandlerTest
#17 124.9 06:17:14 [INFO] Tests run: 2, Failures: 0, Errors: 0, Skipped: 0, Time elapsed: 0.001 s - in ru.rshbintech.retail.frontsystem.efr.biz.ocrm.test.communications.unit.processes.delegates.report.sending.ProcessStartHandlerTest
#17 124.9 06:17:14 [INFO] Running ru.rshbintech.retail.frontsystem.efr.biz.ocrm.test.communications.unit.processes.delegates.report.sending.FormatErrorDelegateTest
#17 124.9 06:17:14 [INFO] Tests run: 1, Failures: 0, Errors: 0, Skipped: 0, Time elapsed: 0 s - in ru.rshbintech.retail.frontsystem.efr.biz.ocrm.test.communications.unit.processes.delegates.report.sending.FormatErrorDelegateTest
#17 124.9 06:17:14 [INFO] Running ru.rshbintech.retail.frontsystem.efr.biz.ocrm.test.communications.unit.processes.delegates.report.sending.AppealCreationDelegateTest
#17 124.9 06:17:14 [INFO] Tests run: 2, Failures: 0, Errors: 0, Skipped: 0, Time elapsed: 0.005 s - in ru.rshbintech.retail.frontsystem.efr.biz.ocrm.test.communications.unit.processes.delegates.report.sending.AppealCreationDelegateTest
#17 124.9 06:17:14 [INFO] Running ru.rshbintech.retail.frontsystem.efr.biz.ocrm.test.communications.unit.processes.delegates.report.sending.InitializationDelegateTest
#17 124.9 06:17:14 [INFO] Tests run: 11, Failures: 0, Errors: 0, Skipped: 0, Time elapsed: 0.007 s - in ru.rshbintech.retail.frontsystem.efr.biz.ocrm.test.communications.unit.processes.delegates.report.sending.InitializationDelegateTest
#17 124.9 06:17:14 [INFO] Running ru.rshbintech.retail.frontsystem.efr.biz.ocrm.test.communications.unit.processes.delegates.report.sending.ValidationDelegateTest
#17 124.9 06:17:14 [INFO] Tests run: 3, Failures: 0, Errors: 0, Skipped: 0, Time elapsed: 0.001 s - in ru.rshbintech.retail.frontsystem.efr.biz.ocrm.test.communications.unit.processes.delegates.report.sending.ValidationDelegateTest
#17 124.9 06:17:14 [INFO] Running ru.rshbintech.retail.frontsystem.efr.biz.ocrm.test.communications.unit.processes.delegates.report.sending.FormReportDelegateTest
#17 125.0 06:17:14 [INFO] Tests run: 5, Failures: 0, Errors: 0, Skipped: 0, Time elapsed: 0.017 s - in ru.rshbintech.retail.frontsystem.efr.biz.ocrm.test.communications.unit.processes.delegates.report.sending.FormReportDelegateTest
#17 125.0 06:17:14 [INFO] Running ru.rshbintech.retail.frontsystem.efr.biz.ocrm.test.communications.unit.TopicsServiceTest
#17 125.0 06:17:14 [ERROR] Tests run: 11, Failures: 1, Errors: 0, Skipped: 0, Time elapsed: 0.034 s <<< FAILURE! - in ru.rshbintech.retail.frontsystem.efr.biz.ocrm.test.communications.unit.TopicsServiceTest
#17 125.0 06:17:14 [ERROR] getAllByParentTopicId_shouldFilterVipTopicsWithNestedStructure_whenParentIdIsNullAndClientIsVipAndNoVipRights Time elapsed: 0.011 s <<< FAILURE!
#17 125.0 org.opentest4j.AssertionFailedError: expected: <1> but was: <0>
#17 125.0 at ru.rshbintech.retail.frontsystem.efr.biz.ocrm.test.communications.unit.TopicsServiceTest.getAllByParentTopicId_shouldFilterVipTopicsWithNestedStructure_whenParentIdIsNullAndClientIsVipAndNoVipRights(TopicsServiceTest.java:123)
#17 125.0
#17 125.0 06:17:14 [INFO] Running ru.rshbintech.retail.frontsystem.efr.biz.ocrm.test.communications.unit.credit.GetCreditDetailsByIdResponseHelperTest
#17 125.0 06:17:14 [INFO] Tests run: 3, Failures: 0, Errors: 0, Skipped: 0, Time elapsed: 0.001 s - in ru.rshbintech.retail.frontsystem.efr.biz.ocrm.test.communications.unit.credit.GetCreditDetailsByIdResponseHelperTest
#17 125.0 06:17:14 [INFO] Running ru.rshbintech.retail.frontsystem.efr.biz.ocrm.test.communications.unit.ExternalSystemUtilsTest
#17 125.0 06:17:14 [INFO] Tests run: 3, Failures: 0, Errors: 0, Skipped: 0, Time elapsed: 0 s - in ru.rshbintech.retail.frontsystem.efr.biz.ocrm.test.communications.unit.ExternalSystemUtilsTest
#17 125.0 06:17:14 [INFO] Running ru.rshbintech.retail.frontsystem.efr.biz.ocrm.test.communications.unit.ContactUtilsTest
#17 125.0 06:17:14 [INFO] Tests run: 9, Failures: 0, Errors: 0, Skipped: 0, Time elapsed: 0.001 s - in ru.rshbintech.retail.frontsystem.efr.biz.ocrm.test.communications.unit.ContactUtilsTest
#17 125.0 06:17:14 [INFO] Running ru.rshbintech.retail.frontsystem.efr.biz.ocrm.communications.mappers.CreateClientAppealMapperTest
#17 125.0 06:17:14 [INFO] Tests run: 10, Failures: 0, Errors: 0, Skipped: 0, Time elapsed: 0 s - in ru.rshbintech.retail.frontsystem.efr.biz.ocrm.communications.mappers.CreateClientAppealMapperTest
#17 125.0 06:17:14 [INFO] Running ru.rshbintech.retail.frontsystem.efr.biz.ocrm.communications.services.cdi.CdiPublishPersonServiceStaticTest
#17 125.1 06:17:14 [INFO] Tests run: 13, Failures: 0, Errors: 0, Skipped: 0, Time elapsed: 0.008 s - in ru.rshbintech.retail.frontsystem.efr.biz.ocrm.communications.services.cdi.CdiPublishPersonServiceStaticTest
#17 125.1 06:17:14 [INFO] Running ru.rshbintech.retail.frontsystem.efr.biz.ocrm.communications.utils.TicketParserTest
#17 125.1 06:17:14 [INFO] Tests run: 37, Failures: 0, Errors: 0, Skipped: 0, Time elapsed: 0.015 s - in ru.rshbintech.retail.frontsystem.efr.biz.ocrm.communications.utils.TicketParserTest
#17 125.1 06:17:14 [INFO] Running ru.rshbintech.retail.frontsystem.efr.biz.ocrm.test.communications.unit.database.services.DiscrepancyFlServiceTest
#17 125.1 06:17:14 [INFO] Tests run: 11, Failures: 0, Errors: 0, Skipped: 0, Time elapsed: 0.044 s - in ru.rshbintech.retail.frontsystem.efr.biz.ocrm.test.communications.unit.database.services.DiscrepancyFlServiceTest
#17 125.1 06:17:14 [INFO] Running ru.rshbintech.retail.frontsystem.efr.biz.ocrm.test.communications.unit.synchronization.DiscrepancyFlKafkaConsumerTest
#17 125.2 06:17:14 [INFO] Tests run: 8, Failures: 0, Errors: 0, Skipped: 0, Time elapsed: 0.098 s - in ru.rshbintech.retail.frontsystem.efr.biz.ocrm.test.communications.unit.synchronization.DiscrepancyFlKafkaConsumerTest
#17 125.2 06:17:14 [INFO] Running ru.rshbintech.retail.frontsystem.efr.biz.ocrm.test.communications.unit.processes.PersonCDIProcessTest
#17 130.2 06:17:19 [INFO] Tests run: 7, Failures: 0, Errors: 0, Skipped: 0, Time elapsed: 4.92 s - in ru.rshbintech.retail.frontsystem.efr.biz.ocrm.test.communications.unit.processes.PersonCDIProcessTest
#17 130.2 06:17:19 [INFO] Running ru.rshbintech.retail.frontsystem.efr.biz.ocrm.test.communications.unit.processes.AppealRegistrationProcessTest
#17 134.3 06:17:24 [INFO] Tests run: 16, Failures: 0, Errors: 0, Skipped: 0, Time elapsed: 4.187 s - in ru.rshbintech.retail.frontsystem.efr.biz.ocrm.test.communications.unit.processes.AppealRegistrationProcessTest
#17 134.3 06:17:24 [INFO] Running ru.rshbintech.retail.frontsystem.efr.biz.ocrm.test.communications.unit.processes.TaskRegistrationSubprocessTest
#17 135.3 06:17:24 [INFO] Tests run: 6, Failures: 0, Errors: 0, Skipped: 0, Time elapsed: 0.9 s - in ru.rshbintech.retail.frontsystem.efr.biz.ocrm.test.communications.unit.processes.TaskRegistrationSubprocessTest
#17 135.3 06:17:24 [INFO] Running ru.rshbintech.retail.frontsystem.efr.biz.ocrm.test.communications.unit.processes.delegates.cdi.CdiCancelConsentProcessTest
#17 135.3 06:17:24 [WARNING] Tests run: 1, Failures: 0, Errors: 0, Skipped: 1, Time elapsed: 0 s - in ru.rshbintech.retail.frontsystem.efr.biz.ocrm.test.communications.unit.processes.delegates.cdi.CdiCancelConsentProcessTest
#17 135.3 06:17:24 [INFO] Running ru.rshbintech.retail.frontsystem.efr.biz.ocrm.test.communications.unit.processes.ReportFormSendingForProductProcessTest
#17 137.3 06:17:27 [INFO] Tests run: 8, Failures: 0, Errors: 0, Skipped: 0, Time elapsed: 2.06 s - in ru.rshbintech.retail.frontsystem.efr.biz.ocrm.test.communications.unit.processes.ReportFormSendingForProductProcessTest
#17 137.3 06:17:27 [INFO] Running ru.rshbintech.retail.frontsystem.efr.biz.ocrm.test.communications.unit.processes.SbpServiceBlockingProcessTest
#17 138.7 06:17:28 [INFO] Tests run: 9, Failures: 0, Errors: 0, Skipped: 0, Time elapsed: 1.361 s - in ru.rshbintech.retail.frontsystem.efr.biz.ocrm.test.communications.unit.processes.SbpServiceBlockingProcessTest
#17 138.7 06:17:28 [INFO] Running ru.rshbintech.retail.frontsystem.efr.biz.ocrm.test.communications.unit.processes.ReportSendingSubprocessTest
#17 139.2 06:17:28 [INFO] Tests run: 6, Failures: 0, Errors: 0, Skipped: 0, Time elapsed: 0.507 s - in ru.rshbintech.retail.frontsystem.efr.biz.ocrm.test.communications.unit.processes.ReportSendingSubprocessTest
#17 139.2 06:17:28 [INFO] Running ru.rshbintech.retail.frontsystem.efr.biz.ocrm.test.communications.unit.processes.BlockCardAppealSubprocessTest
#17 139.9 06:17:29 [INFO] Tests run: 6, Failures: 0, Errors: 0, Skipped: 0, Time elapsed: 0.656 s - in ru.rshbintech.retail.frontsystem.efr.biz.ocrm.test.communications.unit.processes.BlockCardAppealSubprocessTest
#17 139.9 06:17:29 [INFO] Running ru.rshbintech.retail.frontsystem.efr.biz.ocrm.test.communications.unit.processes.ClientAuthenticationSubprocessTest
#17 141.7 06:17:31 [INFO] Tests run: 19, Failures: 0, Errors: 0, Skipped: 0, Time elapsed: 1.815 s - in ru.rshbintech.retail.frontsystem.efr.biz.ocrm.test.communications.unit.processes.ClientAuthenticationSubprocessTest
#17 141.7 06:17:31 [INFO] Running ru.rshbintech.retail.frontsystem.efr.biz.ocrm.test.communications.unit.processes.SbpServiceUnblockingProcessTest
#17 142.0 06:17:31 [INFO] Tests run: 4, Failures: 0, Errors: 0, Skipped: 0, Time elapsed: 0.32 s - in ru.rshbintech.retail.frontsystem.efr.biz.ocrm.test.communications.unit.processes.SbpServiceUnblockingProcessTest
#17 142.0 06:17:31 [INFO] Running ru.rshbintech.retail.frontsystem.efr.biz.ocrm.test.communications.unit.processes.BlockCardDboAppealSubprocessTest
#17 142.0 06:17:31 [WARNING] Tests run: 1, Failures: 0, Errors: 0, Skipped: 1, Time elapsed: 0 s - in ru.rshbintech.retail.frontsystem.efr.biz.ocrm.test.communications.unit.processes.BlockCardDboAppealSubprocessTest
#17 142.0 06:17:31 [INFO] Running ru.rshbintech.retail.frontsystem.efr.biz.ocrm.test.communications.unit.processes.BlockDboAppealSubprocessTest
#17 142.7 06:17:32 [INFO] Tests run: 7, Failures: 0, Errors: 0, Skipped: 0, Time elapsed: 0.613 s - in ru.rshbintech.retail.frontsystem.efr.biz.ocrm.test.communications.unit.processes.BlockDboAppealSubprocessTest
#17 142.7 06:17:32 [INFO] Running ru.rshbintech.retail.frontsystem.efr.biz.ocrm.test.communications.unit.processes.cft.InformationModelAppealProcessTest
#17 145.8 06:17:35 [INFO] Tests run: 3, Failures: 0, Errors: 0, Skipped: 0, Time elapsed: 3.14 s - in ru.rshbintech.retail.frontsystem.efr.biz.ocrm.test.communications.unit.processes.cft.InformationModelAppealProcessTest
#17 145.8 06:17:35 [INFO] Running ru.rshbintech.retail.frontsystem.efr.biz.ocrm.communications.services.CreateClientAppealServiceTest
#17 145.8 06:17:35 [INFO] Tests run: 8, Failures: 0, Errors: 0, Skipped: 0, Time elapsed: 0.013 s - in ru.rshbintech.retail.frontsystem.efr.biz.ocrm.communications.services.CreateClientAppealServiceTest
#17 146.5 06:17:36 [INFO]
#17 146.5 06:17:36 [INFO] Results:
#17 146.5 06:17:36 [INFO]
#17 146.5 06:17:36 [ERROR] Failures:
#17 146.5 06:17:36 [ERROR] TopicsServiceTest.getAllByParentTopicId_shouldFilterVipTopicsWithNestedStructure_whenParentIdIsNullAndClientIsVipAndNoVipRights:123 expected: <1> but was: <0>
#17 146.5 06:17:36 [INFO]
#17 146.5 06:17:36 [ERROR] Tests run: 765, Failures: 1, Errors: 0, Skipped: 15
#17 146.5 06:17:36 [INFO]
#17 146.6 06:17:36 [INFO] ------------------------------------------------------------------------
#17 146.6 06:17:36 [INFO] Reactor Summary for ocrm-communication-service feature-eco-dcc-738-fix-SNAPSHOT:
#17 146.6 06:17:36 [INFO]
#17 146.6 06:17:36 [INFO] ocrm-communication-service ......................... SUCCESS [ 1.718 s]
#17 146.6 06:17:36 [INFO] ocrm-communication-service-app ..................... FAILURE [02:21 min]
#17 146.6 06:17:36 [INFO] ------------------------------------------------------------------------
#17 146.6 06:17:36 [INFO] BUILD FAILURE
#17 146.6 06:17:36 [INFO] ------------------------------------------------------------------------
#17 146.6 06:17:36 [INFO] Total time: 02:24 min (Wall Clock)
#17 146.6 06:17:36 [INFO] Finished at: 2026-09-08T06:17:36Z
#17 146.6 06:17:36 [INFO] ------------------------------------------------------------------------
#17 146.6 06:17:36 [ERROR] Failed to execute goal org.apache.maven.plugins:maven-surefire-plugin:2.22.0:test (default-test) on project ocrm-communication-service-app: There are test failures.
#17 146.6 06:17:36 [ERROR]
#17 146.6 06:17:36 [ERROR] Please refer to /app/ocrm-communication-service-app/target/surefire-reports for the individual test results.
#17 146.6 06:17:36 [ERROR] Please refer to dump files (if any exist) [date]-jvmRun[N].dump, [date].dumpstream and [date]-jvmRun[N].dumpstream.
#17 146.6 06:17:36 [ERROR] -> [Help 1]
#17 146.6 org.apache.maven.lifecycle.LifecycleExecutionException: Failed to execute goal org.apache.maven.plugins:maven-surefire-plugin:2.22.0:test (default-test) on project ocrm-communication-service-app: There are test failures.
#17 146.6
#17 146.6 Please refer to /app/ocrm-communication-service-app/target/surefire-reports for the individual test results.
#17 146.6 Please refer to dump files (if any exist) [date]-jvmRun[N].dump, [date].dumpstream and [date]-jvmRun[N].dumpstream.
#17 146.6 at org.apache.maven.lifecycle.internal.MojoExecutor.doExecute2 (MojoExecutor.java:333)
#17 146.6 at org.apache.maven.lifecycle.internal.MojoExecutor.doExecute (MojoExecutor.java:316)
#17 146.6 at org.apache.maven.lifecycle.internal.MojoExecutor.execute (MojoExecutor.java:212)
#17 146.6 at org.apache.maven.lifecycle.internal.MojoExecutor.execute (MojoExecutor.java:174)
#17 146.6 at org.apache.maven.lifecycle.internal.MojoExecutor.access$000 (MojoExecutor.java:75)
#17 146.6 at org.apache.maven.lifecycle.internal.MojoExecutor$1.run (MojoExecutor.java:162)
#17 146.6 at org.apache.maven.plugin.DefaultMojosExecutionStrategy.execute (DefaultMojosExecutionStrategy.java:39)
#17 146.6 at org.apache.maven.lifecycle.internal.MojoExecutor.execute (MojoExecutor.java:159)
#17 146.6 at org.apache.maven.lifecycle.internal.LifecycleModuleBuilder.buildProject (LifecycleModuleBuilder.java:105)
#17 146.6 at org.apache.maven.lifecycle.internal.builder.multithreaded.MultiThreadedBuilder$1.call (MultiThreadedBuilder.java:193)
#17 146.6 at org.apache.maven.lifecycle.internal.builder.multithreaded.MultiThreadedBuilder$1.call (MultiThreadedBuilder.java:180)
#17 146.6 at java.util.concurrent.FutureTask.run (FutureTask.java:317)
#17 146.6 at java.util.concurrent.Executors$RunnableAdapter.call (Executors.java:572)
#17 146.6 at java.util.concurrent.FutureTask.run (FutureTask.java:317)
#17 146.6 at java.util.concurrent.ThreadPoolExecutor.runWorker (ThreadPoolExecutor.java:1144)
#17 146.6 at java.util.concurrent.ThreadPoolExecutor$Worker.run (ThreadPoolExecutor.java:642)
#17 146.6 at java.lang.Thread.run (Thread.java:1583)
#17 146.6 Caused by: org.apache.maven.plugin.MojoFailureException: There are test failures.
#17 146.6
#17 146.6 Please refer to /app/ocrm-communication-service-app/target/surefire-reports for the individual test results.
#17 146.6 Please refer to dump files (if any exist) [date]-jvmRun[N].dump, [date].dumpstream and [date]-jvmRun[N].dumpstream.
#17 146.6 at org.apache.maven.plugin.surefire.SurefireHelper.throwException (SurefireHelper.java:240)
#17 146.6 at org.apache.maven.plugin.surefire.SurefireHelper.reportExecution (SurefireHelper.java:112)
#17 146.6 at org.apache.maven.plugin.surefire.SurefirePlugin.handleSummary (SurefirePlugin.java:364)
#17 146.6 at org.apache.maven.plugin.surefire.AbstractSurefireMojo.executeAfterPreconditionsChecked (AbstractSurefireMojo.java:1052)
#17 146.6 at org.apache.maven.plugin.surefire.AbstractSurefireMojo.execute (AbstractSurefireMojo.java:868)
#17 146.6 at org.apache.maven.plugin.DefaultBuildPluginManager.executeMojo (DefaultBuildPluginManager.java:126)
#17 146.6 at org.apache.maven.lifecycle.internal.MojoExecutor.doExecute2 (MojoExecutor.java:328)
#17 146.6 at org.apache.maven.lifecycle.internal.MojoExecutor.doExecute (MojoExecutor.java:316)
#17 146.6 at org.apache.maven.lifecycle.internal.MojoExecutor.execute (MojoExecutor.java:212)
#17 146.6 at org.apache.maven.lifecycle.internal.MojoExecutor.execute (MojoExecutor.java:174)
#17 146.6 at org.apache.maven.lifecycle.internal.MojoExecutor.access$000 (MojoExecutor.java:75)
#17 146.6 at org.apache.maven.lifecycle.internal.MojoExecutor$1.run (MojoExecutor.java:162)
#17 146.6 at org.apache.maven.plugin.DefaultMojosExecutionStrategy.execute (DefaultMojosExecutionStrategy.java:39)
#17 146.6 at org.apache.maven.lifecycle.internal.MojoExecutor.execute (MojoExecutor.java:159)
#17 146.6 at org.apache.maven.lifecycle.internal.LifecycleModuleBuilder.buildProject (LifecycleModuleBuilder.java:105)
#17 146.6 at org.apache.maven.lifecycle.internal.builder.multithreaded.MultiThreadedBuilder$1.call (MultiThreadedBuilder.java:193)
#17 146.6 at org.apache.maven.lifecycle.internal.builder.multithreaded.MultiThreadedBuilder$1.call (MultiThreadedBuilder.java:180)
#17 146.6 at java.util.concurrent.FutureTask.run (FutureTask.java:317)
#17 146.6 at java.util.concurrent.Executors$RunnableAdapter.call (Executors.java:572)
#17 146.6 at java.util.concurrent.FutureTask.run (FutureTask.java:317)
#17 146.6 at java.util.concurrent.ThreadPoolExecutor.runWorker (ThreadPoolExecutor.java:1144)
#17 146.6 at java.util.concurrent.ThreadPoolExecutor$Worker.run (ThreadPoolExecutor.java:642)
#17 146.6 at java.lang.Thread.run (Thread.java:1583)
#17 146.6 06:17:36 [ERROR]
#17 146.6 06:17:36 [ERROR] Re-run Maven using the -X switch to enable full debug logging.
#17 146.6 06:17:36 [ERROR]
#17 146.6 06:17:36 [ERROR] For more information about the errors and possible solutions, please read the following articles:
#17 146.6 06:17:36 [ERROR] [Help 1] http://cwiki.apache.org/confluence/display/MAVEN/MojoFailureException
#17 146.6 06:17:36 [ERROR]
#17 146.6 06:17:36 [ERROR] After correcting the problems, you can resume the build with the command
#17 146.6 06:17:36 [ERROR] mvn <args> -rf :ocrm-communication-service-app
#17 ERROR: process "/bin/sh -c mvn ${MAVEN_CLI_OPTS} test" did not complete successfully: exit code: 1
------
> importing cache manifest from registry-cache.rshbdev.ru/buildkit-cache/rshbintech/retail/crm-systems/efrfl-ocrm/communication-service:94d4397aac7b64ec7acf5ecc4917602a10714a4a-test:
------
------
> [test 1/2] RUN mvn --batch-mode --errors --show-version -T 8C test:
146.6 at java.util.concurrent.ThreadPoolExecutor$Worker.run (ThreadPoolExecutor.java:642)
146.6 at java.lang.Thread.run (Thread.java:1583)
146.6 06:17:36 [ERROR]
146.6 06:17:36 [ERROR] Re-run Maven using the -X switch to enable full debug logging.
146.6 06:17:36 [ERROR]
146.6 06:17:36 [ERROR] For more information about the errors and possible solutions, please read the following articles:
146.6 06:17:36 [ERROR] [Help 1] http://cwiki.apache.org/confluence/display/MAVEN/MojoFailureException
146.6 06:17:36 [ERROR]
146.6 06:17:36 [ERROR] After correcting the problems, you can resume the build with the command
146.6 06:17:36 [ERROR] mvn <args> -rf :ocrm-communication-service-app
------
Dockerfile:28
--------------------
26 |
27 | FROM build as test
28 | >>> RUN mvn ${MAVEN_CLI_OPTS} test
29 | RUN export COV_REP_FILE=target/site/jacoco/index.html && [ -f "$COV_REP_FILE" ] && cat $COV_REP_FILE || true
30 |
--------------------
error: failed to solve: process "/bin/sh -c mvn ${MAVEN_CLI_OPTS} test" did not complete successfully: exit code: 1
> [FATAL] Не удалось выполнить команду /buildkit-journey:
ошибка при выполнении дочернего процесса "buildctl": exit status 1
Uploading artifacts for failed job
00:01
Uploading artifacts...
WARNING: app/**/target/surefire-reports: no matching files. Ensure that the artifact path is relative to the working directory (/builds/rshbintech/retail/crm-systems/efrfl-ocrm/communication-service)
ERROR: No files to upload
Uploading artifacts...
WARNING: app/target/surefire-reports/TEST-*.xml: no matching files. Ensure that the artifact path is relative to the working directory (/builds/rshbintech/retail/crm-systems/efrfl-ocrm/communication-service)
WARNING: app/target/failsafe-reports/TEST-*.xml: no matching files. Ensure that the artifact path is relative to the working directory (/builds/rshbintech/retail/crm-systems/efrfl-ocrm/communication-service)
WARNING: app/**/target/surefire-reports/TEST-*.xml: no matching files. Ensure that the artifact path is relative to the working directory (/builds/rshbintech/retail/crm-systems/efrfl-ocrm/communication-service)
WARNING: app/**/target/failsafe-reports/TEST-*.xml: no matching files. Ensure that the artifact path is relative to the working directory (/builds/rshbintech/retail/crm-systems/efrfl-ocrm/communication-service)
ERROR: No files to upload
Cleaning up project directory and file based variables
00:00
ERROR: Job failed: command terminated with exit code 1