#17 125.0 06:17:14 [INFO] Running ru.rshbintech.retail.frontsystem.efr.biz.ocrm.test.communications.unit.TopicsServiceTest
#17 125.0 06:17:14 [ERROR] Tests run: 11, Failures: 1, Errors: 0, Skipped: 0, Time elapsed: 0.034 s <<< FAILURE! - in ru.rshbintech.retail.frontsystem.efr.biz.ocrm.test.communications.unit.TopicsServiceTest
#17 125.0 06:17:14 [ERROR] getAllByParentTopicId_shouldFilterVipTopicsWithNestedStructure_whenParentIdIsNullAndClientIsVipAndNoVipRights Time elapsed: 0.011 s <<< FAILURE!
#17 125.0 org.opentest4j.AssertionFailedError: expected: <1> but was: <0>
#17 125.0 at ru.rshbintech.retail.frontsystem.efr.biz.ocrm.test.communications.unit.TopicsServiceTest.getAllByParentTopicId_shouldFilterVipTopicsWithNestedStructure_whenParentIdIsNullAndClientIsVipAndNoVipRights(TopicsServiceTest.java:123)